BDBM50401748 CHEMBL2207131
SMILES: N[C@@H](Cc1ccccc1)C(=O)OCC(O)=O
InChI Key: InChIKey=GXNXKYLDEYCTMX-VIFPVBQESA-N
Data: 2 IC50
Activity Spreadsheet -- Enzyme Inhibition Constant Data from BindingDB
Found 2 hits for monomerid = 50401748
Trg + Lig
Ki
nM
ΔG°
kcal/mole
IC50
nM
Kd
nM
EC50/IC50
nM
koff
s-1
kon
M-1s-1
pHTemp
°C
Peptidyl-glycine alpha-amidating monooxygenase
(Homo sapiens (Human))
BDBM50401748
(CHEMBL2207131)
Show SMILES N[C@@H](Cc1ccccc1)C(=O)OCC(O)=O |r|
Show InChI InChI=1S/C11H13NO4/c12-9(11(15)16-7-10(13)14)6-8-4-2-1-3-5-8/h1-5,9H,6-7,12H2,(H,13,14)/t9-/m0/s1
n/an/a 1.10E+6n/an/an/an/an/an/a
Australian National University
Curated by ChEMBL
Assay Description
Competitive inhibition of PAM in human DMS53 cells using as(R)-Tyr-(S)-Val-Gly as substrate after 2 hrs by HPLC analysis
Bioorg Med Chem Lett 22: 7015-8 (2012)
Article DOI: 10.1016/j.bmcl.2012.10.004
BindingDB Entry DOI: 10.7270/Q2VT1T73
Peptidyl-glycine alpha-amidating monooxygenase
(Homo sapiens (Human))
BDBM50401748
(CHEMBL2207131)
Show SMILES N[C@@H](Cc1ccccc1)C(=O)OCC(O)=O |r|
Show InChI InChI=1S/C11H13NO4/c12-9(11(15)16-7-10(13)14)6-8-4-2-1-3-5-8/h1-5,9H,6-7,12H2,(H,13,14)/t9-/m0/s1
n/an/a 1.60E+6n/an/an/an/an/an/a
Australian National University
Curated by ChEMBL
Assay Description
Competitive inhibition of secreted PAM in human DMS53 cell culture medium using as(R)-Tyr-(S)-Val-Gly as substrate after 2 hrs by HPLC analysis
Bioorg Med Chem Lett 22: 7015-8 (2012)
Article DOI: 10.1016/j.bmcl.2012.10.004
BindingDB Entry DOI: 10.7270/Q2VT1T73