BDBM50402833 CHEMBL2204100
SMILES: COC(=O)c1c(CN2CCC(CC2)S(C)(=O)=O)c(=O)c2ccc(C)nc2n1-c1ccccc1
InChI Key: InChIKey=FOAAMZPWLWPKOE-UHFFFAOYSA-N
Data: 1 IC50
Activity Spreadsheet -- Enzyme Inhibition Constant Data from BindingDB
Found 1 hit for monomerid = 50402833
Trg + Lig
Ki
nM
ΔG°
kcal/mole
IC50
nM
Kd
nM
EC50/IC50
nM
koff
s-1
kon
M-1s-1
pHTemp
°C
Mitogen-activated protein kinase 9
(Homo sapiens (Human))
BDBM50402833
(CHEMBL2204100)
Show SMILES COC(=O)c1c(CN2CCC(CC2)S(C)(=O)=O)c(=O)c2ccc(C)nc2n1-c1ccccc1
Show InChI InChI=1S/C24H27N3O5S/c1-16-9-10-19-22(28)20(15-26-13-11-18(12-14-26)33(3,30)31)21(24(29)32-2)27(23(19)25-16)17-7-5-4-6-8-17/h4-10,18H,11-15H2,1-3H3
NCI pathway
Reactome pathway
n/an/a 190n/an/an/an/an/an/a
Roche Palo Alto
Curated by ChEMBL
Assay Description
Inhibition of human JNK2 alpha2 using GST-tagged ATF2 as substrate and [gamma33P]ATP incubated for 10 mins prior to substrate addition measured after...
Bioorg Med Chem Lett 22: 7381-7 (2012)
Article DOI: 10.1016/j.bmcl.2012.10.066
BindingDB Entry DOI: 10.7270/Q27S7PZ6