BDBM50403044 CHEMBL179241
SMILES: CCCCCCCC[C@@]1(C)SC(=O)C(CC=C)(CC=C)C1=O
InChI Key: InChIKey=AGBIARLSXFYGHC-GOSISDBHSA-N
Data: 1 IC50  1 EC50
Activity Spreadsheet -- Enzyme Inhibition Constant Data from BindingDB
Found 2 hits for monomerid = 50403044
Trg + Lig
Ki
nM
ΔG°
kcal/mole
IC50
nM
Kd
nM
EC50/IC50
nM
koff
s-1
kon
M-1s-1
pHTemp
°C
Fatty acid synthase
(Homo sapiens (Human))
BDBM50403044
(CHEMBL179241)
Show SMILES CCCCCCCC[C@@]1(C)SC(=O)C(CC=C)(CC=C)C1=O
Show InChI InChI=1S/C19H30O2S/c1-5-8-9-10-11-12-15-18(4)16(20)19(13-6-2,14-7-3)17(21)22-18/h6-7H,2-3,5,8-15H2,1,4H3/t18-/m1/s1
n/an/a>1.55E+5n/an/an/an/an/an/a
Johns Hopkins University
Curated by ChEMBL
Assay Description
Inhibitory concentration against purified human fatty acid synthase activity in ZR-75-1 breast cancer cells
J Med Chem 48: 946-61 (2005)
Article DOI: 10.1021/jm049389h
BindingDB Entry DOI: 10.7270/Q2NS0XN4
Carnitine O-palmitoyltransferase 1, liver isoform
(Homo sapiens (Human))
BDBM50403044
(CHEMBL179241)
Show SMILES CCCCCCCC[C@@]1(C)SC(=O)C(CC=C)(CC=C)C1=O
Show InChI InChI=1S/C19H30O2S/c1-5-8-9-10-11-12-15-18(4)16(20)19(13-6-2,14-7-3)17(21)22-18/h6-7H,2-3,5,8-15H2,1,4H3/t18-/m1/s1
Reactome pathway
n/an/an/an/a 3.00E+3n/an/an/an/a
F. Hoffmann-La Roche Ltd.
Curated by ChEMBL
Assay Description
Increase in CPT1 activity in human MCF7 cells assessed as increase in radiolabeled palmitoylcarnitine
J Med Chem 54: 3109-52 (2011)
Article DOI: 10.1021/jm100809g
BindingDB Entry DOI: 10.7270/Q29K4CDQ