BDBM50404725 CHEMBL157710
SMILES: OC(=O)c1cnc2cc(OCc3ccccc3)ccc2c1O
InChI Key: InChIKey=ABQKYBVDVAXVNO-UHFFFAOYSA-N
Data: 1 IC50
Activity Spreadsheet -- Enzyme Inhibition Constant Data from BindingDB
Found 1 hit for monomerid = 50404725
Trg + Lig
Ki
nM
ΔG°
kcal/mole
IC50
nM
Kd
nM
EC50/IC50
nM
koff
s-1
kon
M-1s-1
pHTemp
°C
Malate Dehydrogenase, mitochondrial
(Sus scrofa (pig))
BDBM50404725
(CHEMBL157710)
Show SMILES OC(=O)c1cnc2cc(OCc3ccccc3)ccc2c1O
Show InChI InChI=1S/C17H13NO4/c19-16-13-7-6-12(22-10-11-4-2-1-3-5-11)8-15(13)18-9-14(16)17(20)21/h1-9H,10H2,(H,18,19)(H,20,21)
Reactome pathway
n/an/a 3.24E+4n/an/an/an/an/an/a
TBA
Curated by ChEMBL
Assay Description
Ability to inhibit mitochondrial malate dehydrogenase
J Med Chem 25: 57-63 (1982)
BindingDB Entry DOI: 10.7270/Q2DR2WQV