null
SMILES: C(Oc1ccccc1)c1nc2ccccc2[nH]1
InChI Key: InChIKey=XATKRQREMKIRLA-UHFFFAOYSA-N
Activity Spreadsheet -- Enzyme Inhibition Constant Data from BindingDB
Found 1 hit for monomerid = 50404885
Trg + Lig
Ki
nM
ΔG°
kcal/mole
IC50
nM
Kd
nM
EC50/IC50
nM
koff
s-1
kon
M-1s-1
pHTemp
°C
Cytochrome P450 2B1
(Rattus norvegicus)
BDBM50404885
(CHEMBL424581)
Show SMILES C(Oc1ccccc1)c1nc2ccccc2[nH]1
Show InChI InChI=1S/C14H12N2O/c1-2-6-11(7-3-1)17-10-14-15-12-8-4-5-9-13(12)16-14/h1-9H,10H2,(H,15,16)
n/an/a 6.92E+4n/an/an/an/an/an/a
TBA
Curated by ChEMBL
Assay Description
Inhibitory potency to aminopyrine N-demethylase activity (P450) in hepatic microsomes from phenobarbitone-induced rats.
J Med Chem 25: 887-92 (1982)
BindingDB Entry DOI: 10.7270/Q2VT1T8J