BDBM50408546 CHEMBL335204
SMILES: CCN1C2CCC1C(C2)c1ccc(Cl)cc1
InChI Key: InChIKey=BYKWZRJIQJVYGD-UHFFFAOYSA-N
Data: 1 Kd
Activity Spreadsheet -- Enzyme Inhibition Constant Data from BindingDB
Found 1 hit for monomerid = 50408546
Trg + Lig
Ki
nM
ΔG°
kcal/mole
IC50
nM
Kd
nM
EC50/IC50
nM
koff
s-1
kon
M-1s-1
pHTemp
°C
Cholinergic, Nicotinic Muscle
(RAT)
BDBM50408546
(CHEMBL335204)
Show SMILES CCN1C2CCC1C(C2)c1ccc(Cl)cc1 |TLB:9:7:2:5.4|
Show InChI InChI=1S/C14H18ClN/c1-2-16-12-7-8-14(16)13(9-12)10-3-5-11(15)6-4-10/h3-6,12-14H,2,7-9H2,1H3
Reactome pathway
n/an/an/a 13.6n/an/an/an/an/a
National Institute on Drug Abuse
Curated by ChEMBL
Assay Description
The compound was tested for the inhibition of binding of [3H]epibatidine to central nicotinic acetylcholine receptor (nAChR) in rat brain.
J Med Chem 41: 4199-206 (1998)
Article DOI: 10.1021/jm980233p
BindingDB Entry DOI: 10.7270/Q2FT8N7Z