BDBM50408890 CHEMBL57301
SMILES: CCc1c(C)[nH]c(=O)c(NC(=O)CCCC(=O)OC)c1Cc1cc(C)cc(C)c1
InChI Key: InChIKey=VPUGTSNKBRDYCG-UHFFFAOYSA-N
Data: 1 EC50
Activity Spreadsheet -- Enzyme Inhibition Constant Data from BindingDB
Found 1 hit for monomerid = 50408890
Trg + Lig
Ki
nM
ΔG°
kcal/mole
IC50
nM
Kd
nM
EC50/IC50
nM
koff
s-1
kon
M-1s-1
pHTemp
°C
Human immunodeficiency virus type 1 reverse transcriptase
(Human immunodeficiency virus 1)
BDBM50408890
(CHEMBL57301)
Show SMILES CCc1c(C)[nH]c(=O)c(NC(=O)CCCC(=O)OC)c1Cc1cc(C)cc(C)c1
Show InChI InChI=1S/C23H30N2O4/c1-6-18-16(4)24-23(28)22(25-20(26)8-7-9-21(27)29-5)19(18)13-17-11-14(2)10-15(3)12-17/h10-12H,6-9,13H2,1-5H3,(H,24,28)(H,25,26)
n/an/an/an/a 2.40E+4n/an/an/an/a
UMR 176 CNRS/Institut Curie
Curated by ChEMBL
Assay Description
Effective concentration required to achieve 50% inhibition of HIV-1 LAI replication in human T4 lymphoblastoid CEM-SS cells.
J Med Chem 43: 1927-39 (2000)
BindingDB Entry DOI: 10.7270/Q2WS8VFT