BDBM50409742 CHEMBL2069129
SMILES: CC(C)(C)[Si](C)(C)O[C@H]1CC[C@@]2(C)C(CC[C@H]3[C@@H]4CC[C@H](C(C)(O)C5CCCCN5)[C@@]4(C)CC[C@H]23)C1
InChI Key: InChIKey=JEJIRIPSVOBZDX-OIXRNZMPSA-N
Data: 1 IC50
Activity Spreadsheet -- Enzyme Inhibition Constant Data from BindingDB
Found 1 hit for monomerid = 50409742
Trg + Lig
Ki
nM
ΔG°
kcal/mole
IC50
nM
Kd
nM
EC50/IC50
nM
koff
s-1
kon
M-1s-1
pHTemp
°C
24-sterol C-methyltransferase
(Arabidopsis thaliana)
BDBM50409742
(CHEMBL2069129)
Show SMILES CC(C)(C)[Si](C)(C)O[C@H]1CC[C@@]2(C)C(CC[C@H]3[C@@H]4CC[C@H](C(C)(O)C5CCCCN5)[C@@]4(C)CC[C@H]23)C1
Show InChI InChI=1S/C32H59NO2Si/c1-29(2,3)36(7,8)35-23-16-18-30(4)22(21-23)12-13-24-25-14-15-27(31(25,5)19-17-26(24)30)32(6,34)28-11-9-10-20-33-28/h22-28,33-34H,9-21H2,1-8H3/t22?,23-,24-,25-,26-,27-,28?,30-,31-,32?/m0/s1
n/an/a 1.22E+4n/an/an/an/an/an/a
Cardiff University
Curated by ChEMBL
Assay Description
In vitro inhibitory concentration against L. major Sterol 24-C-methyltransferase (24-SMT)
J Med Chem 46: 4714-27 (2003)
Article DOI: 10.1021/jm021114j
BindingDB Entry DOI: 10.7270/Q2K073PR