BDBM50410314 CHEMBL2113074
SMILES: Fc1ccc(C[C@@H]2CCCN(C[C@@H]3CCCC[C@H]3NC(=O)Nc3ccc4[nH]ccc4c3)C2)cc1
InChI Key: InChIKey=YHFFIZVSOADVRF-JEYPMZLKSA-N
Data: 3 IC50
Activity Spreadsheet -- Enzyme Inhibition Constant Data from BindingDB
Found 3 hits for monomerid = 50410314
Trg + Lig
Ki
nM
ΔG°
kcal/mole
IC50
nM
Kd
nM
EC50/IC50
nM
koff
s-1
kon
M-1s-1
pHTemp
°C
C-C chemokine receptor type 3
(Homo sapiens (Human))
BDBM50410314
(CHEMBL2113074)
Show SMILES Fc1ccc(C[C@@H]2CCCN(C[C@@H]3CCCC[C@H]3NC(=O)Nc3ccc4[nH]ccc4c3)C2)cc1
Show InChI InChI=1S/C28H35FN4O/c29-24-9-7-20(8-10-24)16-21-4-3-15-33(18-21)19-23-5-1-2-6-27(23)32-28(34)31-25-11-12-26-22(17-25)13-14-30-26/h7-14,17,21,23,27,30H,1-6,15-16,18-19H2,(H2,31,32,34)/t21-,23-,27+/m0/s1
Reactome pathway
n/an/a 0.400n/an/an/an/an/an/a
Pharmaceutical Research Institute
Curated by ChEMBL
Assay Description
Inhibition of [125I]eotaxin binding to human C-C chemokine receptor type 3 expressed in CHO cells
J Med Chem 48: 2194-211 (2005)
Article DOI: 10.1021/jm049530m
BindingDB Entry DOI: 10.7270/Q2XP74F1
C-C chemokine receptor type 3
(Homo sapiens (Human))
BDBM50410314
(CHEMBL2113074)
Show SMILES Fc1ccc(C[C@@H]2CCCN(C[C@@H]3CCCC[C@H]3NC(=O)Nc3ccc4[nH]ccc4c3)C2)cc1
Show InChI InChI=1S/C28H35FN4O/c29-24-9-7-20(8-10-24)16-21-4-3-15-33(18-21)19-23-5-1-2-6-27(23)32-28(34)31-25-11-12-26-22(17-25)13-14-30-26/h7-14,17,21,23,27,30H,1-6,15-16,18-19H2,(H2,31,32,34)/t21-,23-,27+/m0/s1
Reactome pathway
n/an/a 2n/an/an/an/an/an/a
Pharmaceutical Research Institute
Curated by ChEMBL
Assay Description
Inhibition of calcium mobilization in human eosinophils
J Med Chem 48: 2194-211 (2005)
Article DOI: 10.1021/jm049530m
BindingDB Entry DOI: 10.7270/Q2XP74F1
C-C chemokine receptor type 3
(Homo sapiens (Human))
BDBM50410314
(CHEMBL2113074)
Show SMILES Fc1ccc(C[C@@H]2CCCN(C[C@@H]3CCCC[C@H]3NC(=O)Nc3ccc4[nH]ccc4c3)C2)cc1
Show InChI InChI=1S/C28H35FN4O/c29-24-9-7-20(8-10-24)16-21-4-3-15-33(18-21)19-23-5-1-2-6-27(23)32-28(34)31-25-11-12-26-22(17-25)13-14-30-26/h7-14,17,21,23,27,30H,1-6,15-16,18-19H2,(H2,31,32,34)/t21-,23-,27+/m0/s1
Reactome pathway
n/an/a 0.0160n/an/an/an/an/an/a
Pharmaceutical Research Institute
Curated by ChEMBL
Assay Description
Inhibition of eotaxin-induced chemotaxis of human eosinophils
J Med Chem 48: 2194-211 (2005)
Article DOI: 10.1021/jm049530m
BindingDB Entry DOI: 10.7270/Q2XP74F1