null
SMILES: Clc1ccc(CN2C[C@@H]3C[C@H]2CN3)cc1C(=O)NCC12CC3CC(CC(C3)C1)C2
InChI Key: InChIKey=FKPPLJXVWARJKB-XQIWWWIASA-N
Activity Spreadsheet -- Enzyme Inhibition Constant Data from BindingDB
Found 2 hits for monomerid = 50411437
Trg + Lig
Ki
nM
ΔG°
kcal/mole
IC50
nM
Kd
nM
EC50/IC50
nM
koff
s-1
kon
M-1s-1
pHTemp
°C
P2X purinoceptor 7
(Homo sapiens (Human))
BDBM50411437
(CHEMBL392559)
Show SMILES Clc1ccc(CN2C[C@@H]3C[C@H]2CN3)cc1C(=O)NCC12CC3CC(CC(C3)C1)C2 |TLB:18:19:22:26.24.25,THB:24:23:20:26.25.27,24:25:22.23.28:20,27:25:22:28.19.20,27:19:22:26.24.25|
Show InChI InChI=1S/C24H32ClN3O/c25-22-2-1-15(12-28-13-19-7-20(28)11-26-19)6-21(22)23(29)27-14-24-8-16-3-17(9-24)5-18(4-16)10-24/h1-2,6,16-20,26H,3-5,7-14H2,(H,27,29)/t16?,17?,18?,19-,20-,24?/m0/s1
n/an/an/a 5.01n/an/an/an/an/a
AstraZeneca R&D Charnwood
Curated by ChEMBL
Assay Description
Antagonist activity at human P2X7 receptor transfected in THP1 cells assessed as inhibition of benzoyl-ATP-induced changes in plasma membrane pore fo...
J Med Chem 50: 5882-5 (2007)
Article DOI: 10.1021/jm700949w
BindingDB Entry DOI: 10.7270/Q2HQ3ZM9
P2X purinoceptor 7
(Rattus norvegicus (Rat))
BDBM50411437
(CHEMBL392559)
Show SMILES Clc1ccc(CN2C[C@@H]3C[C@H]2CN3)cc1C(=O)NCC12CC3CC(CC(C3)C1)C2 |TLB:18:19:22:26.24.25,THB:24:23:20:26.25.27,24:25:22.23.28:20,27:25:22:28.19.20,27:19:22:26.24.25|
Show InChI InChI=1S/C24H32ClN3O/c25-22-2-1-15(12-28-13-19-7-20(28)11-26-19)6-21(22)23(29)27-14-24-8-16-3-17(9-24)5-18(4-16)10-24/h1-2,6,16-20,26H,3-5,7-14H2,(H,27,29)/t16?,17?,18?,19-,20-,24?/m0/s1
n/an/a 251n/an/an/an/an/an/a
AstraZeneca R&D Charnwood
Curated by ChEMBL
Assay Description
Antagonist activity at rat P2X7 receptor transfected in HEK cells assessed as inhibition of benzylATP-induced changes in plasma membrane pore formati...
J Med Chem 50: 5882-5 (2007)
Article DOI: 10.1021/jm700949w
BindingDB Entry DOI: 10.7270/Q2HQ3ZM9