BDBM50412674 CHEMBL465926
SMILES: Oc1ccc(Cl)cc1C(=O)Nc1ccncc1
InChI Key: InChIKey=GOFGQNJZBLJUBR-UHFFFAOYSA-N
Data: 1 IC50
Activity Spreadsheet -- Enzyme Inhibition Constant Data from BindingDB
Found 1 hit for monomerid = 50412674
Trg + Lig
Ki
nM
ΔG°
kcal/mole
IC50
nM
Kd
nM
EC50/IC50
nM
koff
s-1
kon
M-1s-1
pHTemp
°C
Calcium-activated potassium channel subunit alpha-1
(Homo sapiens (Human))
BDBM50412674
(CHEMBL465926)
Show SMILES Oc1ccc(Cl)cc1C(=O)Nc1ccncc1
Show InChI InChI=1S/C12H9ClN2O2/c13-8-1-2-11(16)10(7-8)12(17)15-9-3-5-14-6-4-9/h1-7,16H,(H,14,15,17)
Reactome pathway
n/an/a 1.17E+4n/an/an/an/an/an/a
Universit£ di Pisa
Curated by ChEMBL
Assay Description
Activation of BK channel-mediated vasorelaxation activity assessed as reduction in KCl-induced contractile tone
Bioorg Med Chem 17: 319-25 (2008)
Article DOI: 10.1016/j.bmc.2008.10.068
BindingDB Entry DOI: 10.7270/Q2P84D59