BDBM50413504 CHEMBL474449
SMILES: NC(NC(=O)CNC(=O)c1cc2ccccc2[nH]1)=NCCCc1cnc[nH]1
InChI Key: InChIKey=PIWSSTXHMGKDJO-UHFFFAOYSA-N
Data: 3 EC50
Activity Spreadsheet -- Enzyme Inhibition Constant Data from BindingDB
Found 3 hits for monomerid = 50413504
Trg + Lig
Ki
nM
ΔG°
kcal/mole
IC50
nM
Kd
nM
EC50/IC50
nM
koff
s-1
kon
M-1s-1
pHTemp
°C
Histamine H4 receptor
(Homo sapiens (Human))
BDBM50413504
(CHEMBL474449)
Show SMILES NC(NC(=O)CNC(=O)c1cc2ccccc2[nH]1)=NCCCc1cnc[nH]1 |w:18.20|
Show InChI InChI=1S/C18H21N7O2/c19-18(21-7-3-5-13-9-20-11-23-13)25-16(26)10-22-17(27)15-8-12-4-1-2-6-14(12)24-15/h1-2,4,6,8-9,11,24H,3,5,7,10H2,(H,20,23)(H,22,27)(H3,19,21,25,26)
Reactome pathway
n/an/an/an/a 28n/an/an/an/a
University of Regensburg
Curated by ChEMBL
Assay Description
Agonist activity at human H4 receptor expressed in insect Sf9 cells co-expressing RGS19 fusion protein and Gialpha2, Gbeta1gamma2 assessed as gamma[3...
J Med Chem 52: 2623-7 (2009)
Article DOI: 10.1021/jm9000693
BindingDB Entry DOI: 10.7270/Q2P270BN
Histamine H3 receptor
(Homo sapiens (Human))
BDBM50413504
(CHEMBL474449)
Show SMILES NC(NC(=O)CNC(=O)c1cc2ccccc2[nH]1)=NCCCc1cnc[nH]1 |w:18.20|
Show InChI InChI=1S/C18H21N7O2/c19-18(21-7-3-5-13-9-20-11-23-13)25-16(26)10-22-17(27)15-8-12-4-1-2-6-14(12)24-15/h1-2,4,6,8-9,11,24H,3,5,7,10H2,(H,20,23)(H,22,27)(H3,19,21,25,26)
Reactome pathway
n/an/an/an/a 16n/an/an/an/a
University of Regensburg
Curated by ChEMBL
Assay Description
Agonist activity at human H3 receptor expressed in insect Sf9 cells co-expressing Gialpha2, Gbeta1gamma2 and RGS4 assessed as gamma[32P]GTP binding b...
J Med Chem 52: 2623-7 (2009)
Article DOI: 10.1021/jm9000693
BindingDB Entry DOI: 10.7270/Q2P270BN
Histamine H2 Receptor
(Homo sapiens (Human))
BDBM50413504
(CHEMBL474449)
Show SMILES NC(NC(=O)CNC(=O)c1cc2ccccc2[nH]1)=NCCCc1cnc[nH]1 |w:18.20|
Show InChI InChI=1S/C18H21N7O2/c19-18(21-7-3-5-13-9-20-11-23-13)25-16(26)10-22-17(27)15-8-12-4-1-2-6-14(12)24-15/h1-2,4,6,8-9,11,24H,3,5,7,10H2,(H,20,23)(H,22,27)(H3,19,21,25,26)
Reactome pathway
n/an/an/an/a 955n/an/an/an/a
University of Regensburg
Curated by ChEMBL
Assay Description
Agonist activity at human H2 receptor expressed in insect Sf9 cells co-expressing GsalphaS fusion protein assessed as gamma[32P]GTP binding by liquid...
J Med Chem 52: 2623-7 (2009)
Article DOI: 10.1021/jm9000693
BindingDB Entry DOI: 10.7270/Q2P270BN