BDBM50415002 CHEMBL576311
SMILES: COc1cccc(Nc2c(cnc3ccccc23)C(N)=O)c1
InChI Key: InChIKey=XCDXNBRLAKWTDV-UHFFFAOYSA-N
Data: 1 IC50
Activity Spreadsheet -- Enzyme Inhibition Constant Data from BindingDB
Found 1 hit for monomerid = 50415002
Trg + Lig
Ki
nM
ΔG°
kcal/mole
IC50
nM
Kd
nM
EC50/IC50
nM
koff
s-1
kon
M-1s-1
pHTemp
°C
cAMP-specific 3',5'-cyclic phosphodiesterase 4B
(Homo sapiens (Human))
BDBM50415002
(CHEMBL576311)
Show SMILES COc1cccc(Nc2c(cnc3ccccc23)C(N)=O)c1
Show InChI InChI=1S/C17H15N3O2/c1-22-12-6-4-5-11(9-12)20-16-13-7-2-3-8-15(13)19-10-14(16)17(18)21/h2-10H,1H3,(H2,18,21)(H,19,20)
n/an/a 200n/an/an/an/an/an/a
GlaxoSmithKline Medicines Research Centre
Curated by ChEMBL
Assay Description
Inhibition of human recombinant PDE4B by scintillation proximity assay
Bioorg Med Chem Lett 19: 5261-5 (2009)
Article DOI: 10.1016/j.bmcl.2009.04.012
BindingDB Entry DOI: 10.7270/Q2K075HB