BDBM50418021 CHEMBL1682274
SMILES: CN(Cc1nc(no1)-c1cn(CC2CCOCC2)c2c(Cl)cccc12)[C@@H](CO)C(N)=O
InChI Key: InChIKey=YJXIZDCRAMKGID-KRWDZBQOSA-N
Data: 1 EC50
Activity Spreadsheet -- Enzyme Inhibition Constant Data from BindingDB
Found 1 hit for monomerid = 50418021
Trg + Lig
Ki
nM
ΔG°
kcal/mole
IC50
nM
Kd
nM
EC50/IC50
nM
koff
s-1
kon
M-1s-1
pHTemp
°C
Cannabinoid receptor 1
(Homo sapiens (Human))
BDBM50418021
(CHEMBL1682274)
Show SMILES CN(Cc1nc(no1)-c1cn(CC2CCOCC2)c2c(Cl)cccc12)[C@@H](CO)C(N)=O |r|
Show InChI InChI=1S/C21H26ClN5O4/c1-26(17(12-28)20(23)29)11-18-24-21(25-31-18)15-10-27(9-13-5-7-30-8-6-13)19-14(15)3-2-4-16(19)22/h2-4,10,13,17,28H,5-9,11-12H2,1H3,(H2,23,29)/t17-/m0/s1
NCI pathway
Reactome pathway
n/an/an/an/a 251n/an/an/an/a
Merck Research Laboratories
Curated by ChEMBL
Assay Description
Agonist activity at human cannabinoid CB1 receptor expressed in CHO cells by luciferase reporter gene assay
Bioorg Med Chem Lett 21: 1748-53 (2011)
Article DOI: 10.1016/j.bmcl.2011.01.082
BindingDB Entry DOI: 10.7270/Q2HD7WWG