BDBM50418335 CHEMBL1770297
SMILES: CCOc1ccc2oc(C(=O)NC(CCSC)c3nc4ccccc4[nH]3)c(C)c2c1
InChI Key: InChIKey=AIMYRLXVAOYQLA-UHFFFAOYSA-N
Data: 2 IC50
Activity Spreadsheet -- Enzyme Inhibition Constant Data from BindingDB
Found 2 hits for monomerid = 50418335
Trg + Lig
Ki
nM
ΔG°
kcal/mole
IC50
nM
Kd
nM
EC50/IC50
nM
koff
s-1
kon
M-1s-1
pHTemp
°C
fMet-Leu-Phe receptor
(Homo sapiens (Human))
BDBM50418335
(CHEMBL1770297)
Show SMILES CCOc1ccc2oc(C(=O)NC(CCSC)c3nc4ccccc4[nH]3)c(C)c2c1
Show InChI InChI=1S/C23H25N3O3S/c1-4-28-15-9-10-20-16(13-15)14(2)21(29-20)23(27)26-19(11-12-30-3)22-24-17-7-5-6-8-18(17)25-22/h5-10,13,19H,4,11-12H2,1-3H3,(H,24,25)(H,26,27)
Reactome pathway
n/an/a 158n/an/an/an/an/an/a
AstraZeneca
Curated by ChEMBL
Assay Description
Antagonist activity at FPR1 in human neutrophils assessed as inhibition of fMLF-stimulated degranulation after 15 mins by fluorescence assay
Bioorg Med Chem Lett 21: 2991-7 (2011)
Article DOI: 10.1016/j.bmcl.2011.03.049
BindingDB Entry DOI: 10.7270/Q2PZ5B2D
fMet-Leu-Phe receptor
(Homo sapiens (Human))
BDBM50418335
(CHEMBL1770297)
Show SMILES CCOc1ccc2oc(C(=O)NC(CCSC)c3nc4ccccc4[nH]3)c(C)c2c1
Show InChI InChI=1S/C23H25N3O3S/c1-4-28-15-9-10-20-16(13-15)14(2)21(29-20)23(27)26-19(11-12-30-3)22-24-17-7-5-6-8-18(17)25-22/h5-10,13,19H,4,11-12H2,1-3H3,(H,24,25)(H,26,27)
Reactome pathway
n/an/a 501n/an/an/an/an/an/a
AstraZeneca
Curated by ChEMBL
Assay Description
Antagonist activity at human FPR1 in human neutrophils assessed as inhibition of fMLF-stimulated intracellular calcium mobilisation by FLIPR assay
Bioorg Med Chem Lett 21: 6456-60 (2011)
Article DOI: 10.1016/j.bmcl.2011.08.085
BindingDB Entry DOI: 10.7270/Q2WD41VZ