null
SMILES: CCc1c(CCN2CC(O)C2)cccc1-c1nsc(n1)-c1ccc(CC(C)C)c(c1)C#N
InChI Key: InChIKey=GSINUWBRRMXBHH-UHFFFAOYSA-N
Activity Spreadsheet -- Enzyme Inhibition Constant Data from BindingDB
Found 2 hits for monomerid = 50420120
Trg + Lig
Ki
nM
ΔG°
kcal/mole
IC50
nM
Kd
nM
EC50/IC50
nM
koff
s-1
kon
M-1s-1
pHTemp
°C
Sphingosine 1-phosphate receptor 3
(Homo sapiens (Human))
BDBM50420120
(CHEMBL2057287)
Show SMILES CCc1c(CCN2CC(O)C2)cccc1-c1nsc(n1)-c1ccc(CC(C)C)c(c1)C#N
Show InChI InChI=1S/C26H30N4OS/c1-4-23-18(10-11-30-15-22(31)16-30)6-5-7-24(23)25-28-26(32-29-25)20-9-8-19(12-17(2)3)21(13-20)14-27/h5-9,13,17,22,31H,4,10-12,15-16H2,1-3H3
NCI pathway
Reactome pathway
n/an/an/an/a>3.16E+3n/an/an/an/a
GlaxoSmithKline
Curated by ChEMBL
Assay Description
Agonist activity against S1P3 receptor by cell based FRET assay
J Med Chem 55: 4286-96 (2012)
Article DOI: 10.1021/jm2016107
BindingDB Entry DOI: 10.7270/Q2F190SQ
Sphingosine 1-phosphate receptor 1
(Homo sapiens (Human))
BDBM50420120
(CHEMBL2057287)
Show SMILES CCc1c(CCN2CC(O)C2)cccc1-c1nsc(n1)-c1ccc(CC(C)C)c(c1)C#N
Show InChI InChI=1S/C26H30N4OS/c1-4-23-18(10-11-30-15-22(31)16-30)6-5-7-24(23)25-28-26(32-29-25)20-9-8-19(12-17(2)3)21(13-20)14-27/h5-9,13,17,22,31H,4,10-12,15-16H2,1-3H3
Reactome pathway
n/an/an/an/a 200n/an/an/an/a
GlaxoSmithKline
Curated by ChEMBL
Assay Description
Agonist activity against S1P1 receptor by cell based FRET assay
J Med Chem 55: 4286-96 (2012)
Article DOI: 10.1021/jm2016107
BindingDB Entry DOI: 10.7270/Q2F190SQ