BDBM50420513 CHEMBL2086520
SMILES: C=CC(=O)Nc1ccc(cc1)S(=O)(=O)N1CCN(CC1)C(=O)CCc1ccccc1
InChI Key: InChIKey=QLXWMPCZCUDTNR-UHFFFAOYSA-N
Data: 3 IC50
Activity Spreadsheet -- Enzyme Inhibition Constant Data from BindingDB
Found 3 hits for monomerid = 50420513
Trg + Lig
Ki
nM
ΔG°
kcal/mole
IC50
nM
Kd
nM
EC50/IC50
nM
koff
s-1
kon
M-1s-1
pHTemp
°C
Protein-glutamine gamma-glutamyltransferase 2 (TG2)
(Homo sapiens (Human))
BDBM50420513
(CHEMBL2086520)
Show SMILES C=CC(=O)Nc1ccc(cc1)S(=O)(=O)N1CCN(CC1)C(=O)CCc1ccccc1
Show InChI InChI=1S/C22H25N3O4S/c1-2-21(26)23-19-9-11-20(12-10-19)30(28,29)25-16-14-24(15-17-25)22(27)13-8-18-6-4-3-5-7-18/h2-7,9-12H,1,8,13-17H2,(H,23,26)
n/an/a 160n/an/an/an/an/an/a
Evotec (UK) Ltd.
Curated by ChEMBL
Assay Description
Inhibition of human recombinant TG2 by fluorescent transamidation assay
J Med Chem 55: 1021-46 (2012)
Article DOI: 10.1021/jm201310y
BindingDB Entry DOI: 10.7270/Q2CN7560
Coagulation factor XIII
(Homo sapiens (Human))
BDBM50420513
(CHEMBL2086520)
Show SMILES C=CC(=O)Nc1ccc(cc1)S(=O)(=O)N1CCN(CC1)C(=O)CCc1ccccc1
Show InChI InChI=1S/C22H25N3O4S/c1-2-21(26)23-19-9-11-20(12-10-19)30(28,29)25-16-14-24(15-17-25)22(27)13-8-18-6-4-3-5-7-18/h2-7,9-12H,1,8,13-17H2,(H,23,26)
Reactome pathway
n/an/a 760n/an/an/an/an/an/a
Evotec (UK) Ltd.
Curated by ChEMBL
Assay Description
Inhibition of thrombin activated human F13a by fluorescent transamidation assay
J Med Chem 55: 1021-46 (2012)
Article DOI: 10.1021/jm201310y
BindingDB Entry DOI: 10.7270/Q2CN7560
Transglutaminase-1 (TG1)
(Homo sapiens (Human))
BDBM50420513
(CHEMBL2086520)
Show SMILES C=CC(=O)Nc1ccc(cc1)S(=O)(=O)N1CCN(CC1)C(=O)CCc1ccccc1
Show InChI InChI=1S/C22H25N3O4S/c1-2-21(26)23-19-9-11-20(12-10-19)30(28,29)25-16-14-24(15-17-25)22(27)13-8-18-6-4-3-5-7-18/h2-7,9-12H,1,8,13-17H2,(H,23,26)
n/an/a 1.00E+4n/an/an/an/an/an/a
Evotec (UK) Ltd.
Curated by ChEMBL
Assay Description
Inhibition of human recombinant TG1 by fluorescent transamidation assay
J Med Chem 55: 1021-46 (2012)
Article DOI: 10.1021/jm201310y
BindingDB Entry DOI: 10.7270/Q2CN7560