BDBM50424948 CHEMBL2315816
SMILES: CCCCCCCCOc1ccc(NC(=O)[C@@](C)(N)CCC(O)=O)cc1
InChI Key: InChIKey=YHRDKNCJARLDDZ-FQEVSTJZSA-N
Data: 2 IC50
Activity Spreadsheet -- Enzyme Inhibition Constant Data from BindingDB
Found 2 hits for monomerid = 50424948
Trg + Lig
Ki
nM
ΔG°
kcal/mole
IC50
nM
Kd
nM
EC50/IC50
nM
koff
s-1
kon
M-1s-1
pHTemp
°C
Sphingosine 1-phosphate receptor 3
(Homo sapiens (Human))
BDBM50424948
(CHEMBL2315816)
Show SMILES CCCCCCCCOc1ccc(NC(=O)[C@@](C)(N)CCC(O)=O)cc1 |r|
Show InChI InChI=1S/C20H32N2O4/c1-3-4-5-6-7-8-15-26-17-11-9-16(10-12-17)22-19(25)20(2,21)14-13-18(23)24/h9-12H,3-8,13-15,21H2,1-2H3,(H,22,25)(H,23,24)/t20-/m0/s1
NCI pathway
Reactome pathway
n/an/a 1.00E+4n/an/an/an/an/an/a
Praecis Pharmaceuticals Incorporated (Currently GlaxoSmithKline)
Curated by ChEMBL
Assay Description
Displacement of [33P]S1P from human S1P3 receptor expressed in HEK293T cells after 1 hr by liquid scintillation counting analysis
Bioorg Med Chem Lett 23: 472-5 (2012)
Article DOI: 10.1016/j.bmcl.2012.11.053
BindingDB Entry DOI: 10.7270/Q2X63P82
Sphingosine 1-phosphate receptor 1
(Homo sapiens (Human))
BDBM50424948
(CHEMBL2315816)
Show SMILES CCCCCCCCOc1ccc(NC(=O)[C@@](C)(N)CCC(O)=O)cc1 |r|
Show InChI InChI=1S/C20H32N2O4/c1-3-4-5-6-7-8-15-26-17-11-9-16(10-12-17)22-19(25)20(2,21)14-13-18(23)24/h9-12H,3-8,13-15,21H2,1-2H3,(H,22,25)(H,23,24)/t20-/m0/s1
Reactome pathway
n/an/a 77n/an/an/an/an/an/a
Praecis Pharmaceuticals Incorporated (Currently GlaxoSmithKline)
Curated by ChEMBL
Assay Description
Displacement of [33P]S1P from human S1P1 receptor expressed in HEK293T cells after 1 hr by liquid scintillation counting analysis
Bioorg Med Chem Lett 23: 472-5 (2012)
Article DOI: 10.1016/j.bmcl.2012.11.053
BindingDB Entry DOI: 10.7270/Q2X63P82