BDBM50427791 CHEMBL2325194
SMILES: OC(CNC(=O)Nc1ccc2nnsc2c1)c1ccccc1F
InChI Key: InChIKey=IXINIROZUDTYLS-UHFFFAOYSA-N
Data: 1 IC50
Activity Spreadsheet -- Enzyme Inhibition Constant Data from BindingDB
Found 1 hit for monomerid = 50427791
Trg + Lig
Ki
nM
ΔG°
kcal/mole
IC50
nM
Kd
nM
EC50/IC50
nM
koff
s-1
kon
M-1s-1
pHTemp
°C
Protein arginine N-methyltransferase 3
(Homo sapiens (Human))
BDBM50427791
(CHEMBL2325194)
Show SMILES OC(CNC(=O)Nc1ccc2nnsc2c1)c1ccccc1F
Show InChI InChI=1S/C15H13FN4O2S/c16-11-4-2-1-3-10(11)13(21)8-17-15(22)18-9-5-6-12-14(7-9)23-20-19-12/h1-7,13,21H,8H2,(H2,17,18,22)
n/an/a 3.30E+3n/an/an/an/an/an/a
University of North Carolina at Chapel Hill
Curated by ChEMBL
Assay Description
Inhibition of PRMT3 (unknown origin) using histone H4 (1 to 24) as substrate after 1 hr by scintillation proximity assay in presence of [3H]-S-adenos...
J Med Chem 56: 2110-24 (2013)
Article DOI: 10.1021/jm3018332
BindingDB Entry DOI: 10.7270/Q2W95BHJ