BDBM50427862 CHEMBL2326361
SMILES: Cc1cc(N)nc(CCc2cc(CCc3cc(C)cc(N)n3)cc(c2)C#N)c1
InChI Key: InChIKey=IXUSJKAERUMZME-UHFFFAOYSA-N
Data: 3 KI  1 Kd
PDB links: 3 PDB IDs match this monomer.
Activity Spreadsheet -- Enzyme Inhibition Constant Data from BindingDB
Found 4 hits for monomerid = 50427862
Trg + Lig
Ki
nM
ΔG°
kcal/mole
IC50
nM
Kd
nM
EC50/IC50
nM
koff
s-1
kon
M-1s-1
pHTemp
°C
Nitric-oxide synthase, brain
(Rattus norvegicus (rat))
BDBM50427862
(CHEMBL2326361)
Show SMILES Cc1cc(N)nc(CCc2cc(CCc3cc(C)cc(N)n3)cc(c2)C#N)c1
Show InChI InChI=1S/C23H25N5/c1-15-7-20(27-22(25)9-15)5-3-17-11-18(13-19(12-17)14-24)4-6-21-8-16(2)10-23(26)28-21/h7-13H,3-6H2,1-2H3,(H2,25,27)(H2,26,28)
56n/an/an/an/an/an/an/an/a
Northwestern University
Curated by ChEMBL
Assay Description
Inhibition of rat recombinant nNOS expressed in Escherichia coli using L-arginine as substrate
J Med Chem 56: 3024-32 (2013)
Article DOI: 10.1021/jm4000984
BindingDB Entry DOI: 10.7270/Q23T9JJ1
3D
3D Structure (crystal)
Nitric Oxide Synthase, inducible
(Mus musculus (mouse))
BDBM50427862
(CHEMBL2326361)
Show SMILES Cc1cc(N)nc(CCc2cc(CCc3cc(C)cc(N)n3)cc(c2)C#N)c1
Show InChI InChI=1S/C23H25N5/c1-15-7-20(27-22(25)9-15)5-3-17-11-18(13-19(12-17)14-24)4-6-21-8-16(2)10-23(26)28-21/h7-13H,3-6H2,1-2H3,(H2,25,27)(H2,26,28)
Reactome pathway
1.34E+4n/an/an/an/an/an/an/an/a
Northwestern University
Curated by ChEMBL
Assay Description
Inhibition of mouse recombinant iNOS expressed in Escherichia coli using L-arginine as substrate
J Med Chem 56: 3024-32 (2013)
Article DOI: 10.1021/jm4000984
BindingDB Entry DOI: 10.7270/Q23T9JJ1
Nitric Oxide Synthase, endothelial
(Bos taurus (bovine))
BDBM50427862
(CHEMBL2326361)
Show SMILES Cc1cc(N)nc(CCc2cc(CCc3cc(C)cc(N)n3)cc(c2)C#N)c1
Show InChI InChI=1S/C23H25N5/c1-15-7-20(27-22(25)9-15)5-3-17-11-18(13-19(12-17)14-24)4-6-21-8-16(2)10-23(26)28-21/h7-13H,3-6H2,1-2H3,(H2,25,27)(H2,26,28)
2.64E+4n/an/an/an/an/an/an/an/a
Northwestern University
Curated by ChEMBL
Assay Description
Inhibition of bovine recombinant eNOS expressed in Escherichia coli using L-arginine as substrate
J Med Chem 56: 3024-32 (2013)
Article DOI: 10.1021/jm4000984
BindingDB Entry DOI: 10.7270/Q23T9JJ1
3D
3D Structure (crystal)
Nitric oxide synthase (bsNOS)
(Bacillus subtilis (Firmicutes))
BDBM50427862
(CHEMBL2326361)
Show SMILES Cc1cc(N)nc(CCc2cc(CCc3cc(C)cc(N)n3)cc(c2)C#N)c1
Show InChI InChI=1S/C23H25N5/c1-15-7-20(27-22(25)9-15)5-3-17-11-18(13-19(12-17)14-24)4-6-21-8-16(2)10-23(26)28-21/h7-13H,3-6H2,1-2H3,(H2,25,27)(H2,26,28)
n/an/an/a 4.47E+3n/an/an/an/an/a
University of California, Irvine
Assay Description
In short, the difference between the imidazole-bound low-spin peak at 430 nm and the inhibitorbound high-spin peak at 395 nm was measured as a functi...
Biochemistry 54: 4075-82 (2015)
Article DOI: 10.1021/acs.biochem.5b00431
BindingDB Entry DOI: 10.7270/Q2Q23Z0J
3D
3D Structure (crystal)