BDBM50428084 CHEMBL2323567::US9303017, (R)-16, YL-1-117
SMILES: CCCCC#Cc1cnc(C)c(OC[C@H]2CCCN2)c1
InChI Key: InChIKey=CZWUYUYQOZHEAK-MRXNPFEDSA-N
Data: 9 KI
Activity Spreadsheet -- Enzyme Inhibition Constant Data from BindingDB
Found 9 hits for monomerid = 50428084
Trg + Lig
Ki
nM
ΔG°
kcal/mole
IC50
nM
Kd
nM
EC50/IC50
nM
koff
s-1
kon
M-1s-1
pHTemp
°C
Neuronal acetylcholine receptor Alpha-4/Beta-2
(Homo sapiens (Human))
BDBM50428084
(CHEMBL2323567 | US9303017, (R)-16, YL-1-117)
Show SMILES CCCCC#Cc1cnc(C)c(OC[C@H]2CCCN2)c1 |r|
Show InChI InChI=1S/C17H24N2O/c1-3-4-5-6-8-15-11-17(14(2)19-12-15)20-13-16-9-7-10-18-16/h11-12,16,18H,3-5,7,9-10,13H2,1-2H3/t16-/m1/s1
NCI pathway
Reactome pathway
US Patent
9.90E+3 -6.34n/an/an/an/an/a7.44
Georgetown University; Duke University
US Patent
Assay Description
Briefly, cultured cells at >80% confluence were removed from their flasks (80 cm^2) with a disposable cell scraper and placed in 10 mL of 50 mM Tris....
US Patent US9303017 (2016)
BindingDB Entry DOI: 10.7270/Q25X27SF
Neuronal acetylcholine receptor Alpha-3/Beta-2
(Rattus norvegicus (Rat))
BDBM50428084
(CHEMBL2323567 | US9303017, (R)-16, YL-1-117)
Show SMILES CCCCC#Cc1cnc(C)c(OC[C@H]2CCCN2)c1 |r|
Show InChI InChI=1S/C17H24N2O/c1-3-4-5-6-8-15-11-17(14(2)19-12-15)20-13-16-9-7-10-18-16/h11-12,16,18H,3-5,7,9-10,13H2,1-2H3/t16-/m1/s1
NCI pathway
Reactome pathway
US Patent
1.90E+4 -5.98n/an/an/an/an/a7.44
Georgetown University; Duke University
US Patent
Assay Description
Briefly, cultured cells at >80% confluence were removed from their flasks (80 cm^2) with a disposable cell scraper and placed in 10 mL of 50 mM Tris....
US Patent US9303017 (2016)
BindingDB Entry DOI: 10.7270/Q25X27SF
Neuronal acetylcholine receptor Alpha-3/Beta-4
(Rattus norvegicus (Rat))
BDBM50428084
(CHEMBL2323567 | US9303017, (R)-16, YL-1-117)
Show SMILES CCCCC#Cc1cnc(C)c(OC[C@H]2CCCN2)c1 |r|
Show InChI InChI=1S/C17H24N2O/c1-3-4-5-6-8-15-11-17(14(2)19-12-15)20-13-16-9-7-10-18-16/h11-12,16,18H,3-5,7,9-10,13H2,1-2H3/t16-/m1/s1
NCI pathway
Reactome pathway
US Patent
2.20E+4 -5.90n/an/an/an/an/a7.44
Georgetown University; Duke University
US Patent
Assay Description
Briefly, cultured cells at >80% confluence were removed from their flasks (80 cm^2) with a disposable cell scraper and placed in 10 mL of 50 mM Tris....
US Patent US9303017 (2016)
BindingDB Entry DOI: 10.7270/Q25X27SF
Neuronal acetylcholine receptor protein alpha-2/beta-2 subunit
(Rattus norvegicus (Rat))
BDBM50428084
(CHEMBL2323567 | US9303017, (R)-16, YL-1-117)
Show SMILES CCCCC#Cc1cnc(C)c(OC[C@H]2CCCN2)c1 |r|
Show InChI InChI=1S/C17H24N2O/c1-3-4-5-6-8-15-11-17(14(2)19-12-15)20-13-16-9-7-10-18-16/h11-12,16,18H,3-5,7,9-10,13H2,1-2H3/t16-/m1/s1
US Patent
2.20E+4 -5.90n/an/an/an/an/a7.44
Georgetown University; Duke University
US Patent
Assay Description
Briefly, cultured cells at >80% confluence were removed from their flasks (80 cm^2) with a disposable cell scraper and placed in 10 mL of 50 mM Tris....
US Patent US9303017 (2016)
BindingDB Entry DOI: 10.7270/Q25X27SF
Neuronal acetylcholine receptor
(Rattus norvegicus (Rat))
BDBM50428084
(CHEMBL2323567 | US9303017, (R)-16, YL-1-117)
Show SMILES CCCCC#Cc1cnc(C)c(OC[C@H]2CCCN2)c1 |r|
Show InChI InChI=1S/C17H24N2O/c1-3-4-5-6-8-15-11-17(14(2)19-12-15)20-13-16-9-7-10-18-16/h11-12,16,18H,3-5,7,9-10,13H2,1-2H3/t16-/m1/s1
Reactome pathway
1.10E+5n/an/an/an/an/an/an/an/a
Georgetown University Medical Center
Curated by ChEMBL
Assay Description
Displacement of [3H]-Epibatidine from rat alpha7 nACHR expressed in HEK293 cell membranes membranes by liquid scintillation counting analysis
J Med Chem 56: 3000-11 (2013)
Article DOI: 10.1021/jm4000374
BindingDB Entry DOI: 10.7270/Q21Z45R1
Neuronal acetylcholine receptor
(Rattus norvegicus (Rat))
BDBM50428084
(CHEMBL2323567 | US9303017, (R)-16, YL-1-117)
Show SMILES CCCCC#Cc1cnc(C)c(OC[C@H]2CCCN2)c1 |r|
Show InChI InChI=1S/C17H24N2O/c1-3-4-5-6-8-15-11-17(14(2)19-12-15)20-13-16-9-7-10-18-16/h11-12,16,18H,3-5,7,9-10,13H2,1-2H3/t16-/m1/s1
Reactome pathway
US Patent
1.10E+5 -5.02n/an/an/an/an/a7.44
Georgetown University; Duke University
US Patent
Assay Description
Briefly, cultured cells at >80% confluence were removed from their flasks (80 cm^2) with a disposable cell scraper and placed in 10 mL of 50 mM Tris....
US Patent US9303017 (2016)
BindingDB Entry DOI: 10.7270/Q25X27SF
Neuronal acetylcholine receptor Alpha-3/Beta-4
(Rattus norvegicus (Rat))
BDBM50428084
(CHEMBL2323567 | US9303017, (R)-16, YL-1-117)
Show SMILES CCCCC#Cc1cnc(C)c(OC[C@H]2CCCN2)c1 |r|
Show InChI InChI=1S/C17H24N2O/c1-3-4-5-6-8-15-11-17(14(2)19-12-15)20-13-16-9-7-10-18-16/h11-12,16,18H,3-5,7,9-10,13H2,1-2H3/t16-/m1/s1
NCI pathway
Reactome pathway
US Patent
2.20E+5 -4.64n/an/an/an/an/a7.44
Georgetown University; Duke University
US Patent
Assay Description
Briefly, cultured cells at >80% confluence were removed from their flasks (80 cm^2) with a disposable cell scraper and placed in 10 mL of 50 mM Tris....
US Patent US9303017 (2016)
BindingDB Entry DOI: 10.7270/Q25X27SF
Neuronal acetylcholine receptor protein alpha-4/beta-4 subunit
(Rattus norvegicus (Rat))
BDBM50428084
(CHEMBL2323567 | US9303017, (R)-16, YL-1-117)
Show SMILES CCCCC#Cc1cnc(C)c(OC[C@H]2CCCN2)c1 |r|
Show InChI InChI=1S/C17H24N2O/c1-3-4-5-6-8-15-11-17(14(2)19-12-15)20-13-16-9-7-10-18-16/h11-12,16,18H,3-5,7,9-10,13H2,1-2H3/t16-/m1/s1
US Patent
2.70E+5 -4.52n/an/an/an/an/a7.44
Georgetown University; Duke University
US Patent
Assay Description
Briefly, cultured cells at >80% confluence were removed from their flasks (80 cm^2) with a disposable cell scraper and placed in 10 mL of 50 mM Tris....
US Patent US9303017 (2016)
BindingDB Entry DOI: 10.7270/Q25X27SF
Neuronal acetylcholine receptor Alpha-2/Beta-4
(Rattus norvegicus (Rat))
BDBM50428084
(CHEMBL2323567 | US9303017, (R)-16, YL-1-117)
Show SMILES CCCCC#Cc1cnc(C)c(OC[C@H]2CCCN2)c1 |r|
Show InChI InChI=1S/C17H24N2O/c1-3-4-5-6-8-15-11-17(14(2)19-12-15)20-13-16-9-7-10-18-16/h11-12,16,18H,3-5,7,9-10,13H2,1-2H3/t16-/m1/s1
Reactome pathway
US Patent
3.70E+5 -4.35n/an/an/an/an/a7.44
Georgetown University; Duke University
US Patent
Assay Description
Briefly, cultured cells at >80% confluence were removed from their flasks (80 cm^2) with a disposable cell scraper and placed in 10 mL of 50 mM Tris....
US Patent US9303017 (2016)
BindingDB Entry DOI: 10.7270/Q25X27SF