null
SMILES: CN1CCC(COCc2cc(cc(n2)C2CC2)C(F)(F)F)(CC1)c1ccccc1
InChI Key: InChIKey=FHFZPUAWDJVXHA-UHFFFAOYSA-N
Activity Spreadsheet -- Enzyme Inhibition Constant Data from BindingDB
Found 3 hits for monomerid = 50428759
Trg + Lig
Ki
nM
ΔG°
kcal/mole
IC50
nM
Kd
nM
EC50/IC50
nM
koff
s-1
kon
M-1s-1
pHTemp
°C
Potassium voltage-gated channel subfamily H member 2
(Homo sapiens (Human))
BDBM50428759
(CHEMBL2333604)
Show SMILES CN1CCC(COCc2cc(cc(n2)C2CC2)C(F)(F)F)(CC1)c1ccccc1
Show InChI InChI=1S/C23H27F3N2O/c1-28-11-9-22(10-12-28,18-5-3-2-4-6-18)16-29-15-20-13-19(23(24,25)26)14-21(27-20)17-7-8-17/h2-6,13-14,17H,7-12,15-16H2,1H3
Reactome pathway
n/an/a 9.00E+3n/an/an/an/an/an/a
Bristol-Myers Squibb Research and Development
Curated by ChEMBL
Assay Description
Inhibition of human ERG
Bioorg Med Chem Lett 23: 407-11 (2012)
Article DOI: 10.1016/j.bmcl.2012.11.094
BindingDB Entry DOI: 10.7270/Q2S46TBT
Sodium-dependent serotonin transporter
(Homo sapiens (Human))
BDBM50428759
(CHEMBL2333604)
Show SMILES CN1CCC(COCc2cc(cc(n2)C2CC2)C(F)(F)F)(CC1)c1ccccc1
Show InChI InChI=1S/C23H27F3N2O/c1-28-11-9-22(10-12-28,18-5-3-2-4-6-18)16-29-15-20-13-19(23(24,25)26)14-21(27-20)17-7-8-17/h2-6,13-14,17H,7-12,15-16H2,1H3
n/an/a 6.80n/an/an/an/an/an/a
Bristol-Myers Squibb Research and Development
Curated by ChEMBL
Assay Description
Displacement of [125I]RTI-55 from human SERT expressed in HEK293 cell membranes after 1 hr by scintillation counting analysis
Bioorg Med Chem Lett 23: 407-11 (2012)
Article DOI: 10.1016/j.bmcl.2012.11.094
BindingDB Entry DOI: 10.7270/Q2S46TBT
Substance-P receptor
(Homo sapiens (Human))
BDBM50428759
(CHEMBL2333604)
Show SMILES CN1CCC(COCc2cc(cc(n2)C2CC2)C(F)(F)F)(CC1)c1ccccc1
Show InChI InChI=1S/C23H27F3N2O/c1-28-11-9-22(10-12-28,18-5-3-2-4-6-18)16-29-15-20-13-19(23(24,25)26)14-21(27-20)17-7-8-17/h2-6,13-14,17H,7-12,15-16H2,1H3
Reactome pathway
n/an/a 2n/an/an/an/an/an/a
Bristol-Myers Squibb Research and Development
Curated by ChEMBL
Assay Description
Displacement of [125I] Substance P from human NK1 receptor expressed in human U373 cell membranes after 1 hr by scintillation counting analysis
Bioorg Med Chem Lett 23: 407-11 (2012)
Article DOI: 10.1016/j.bmcl.2012.11.094
BindingDB Entry DOI: 10.7270/Q2S46TBT