BDBM50429503 CHEMBL2332847
SMILES: Brc1ccc(NC(=O)Nc2ccc(Oc3ncnc4n[nH]cc34)cc2)cc1
InChI Key: InChIKey=ZDABLTOZCXSNEA-UHFFFAOYSA-N
Data: 1 IC50
Activity Spreadsheet -- Enzyme Inhibition Constant Data from BindingDB
Found 1 hit for monomerid = 50429503
Trg + Lig
Ki
nM
ΔG°
kcal/mole
IC50
nM
Kd
nM
EC50/IC50
nM
koff
s-1
kon
M-1s-1
pHTemp
°C
Vascular endothelial growth factor receptor 2
(Danio rerio)
BDBM50429503
(CHEMBL2332847)
Show SMILES Brc1ccc(NC(=O)Nc2ccc(Oc3ncnc4n[nH]cc34)cc2)cc1
Show InChI InChI=1S/C18H13BrN6O2/c19-11-1-3-12(4-2-11)23-18(26)24-13-5-7-14(8-6-13)27-17-15-9-22-25-16(15)20-10-21-17/h1-10H,(H2,23,24,26)(H,20,21,22,25)
Reactome pathway
n/an/a 7.47E+4n/an/an/an/an/an/a
Sichuan University
Curated by ChEMBL
Assay Description
Inhibition of VEGFR2 in transgenic zebrafish embryo assessed as inhibition of intersegmental vessels formation measured 33 hrs post fertilization by ...
J Med Chem 56: 1641-55 (2013)
Article DOI: 10.1021/jm301537p
BindingDB Entry DOI: 10.7270/Q29S1SC5