BDBM50429680 CHEMBL2335384
SMILES: Nc1cc(ccc1N1CCCCC1)N1CCCCC1
InChI Key: InChIKey=WAOUXZZNLNSGRH-UHFFFAOYSA-N
Data: 1 KI  1 IC50
Activity Spreadsheet -- Enzyme Inhibition Constant Data from BindingDB
Found 2 hits for monomerid = 50429680
Trg + Lig
Ki
nM
ΔG°
kcal/mole
IC50
nM
Kd
nM
EC50/IC50
nM
koff
s-1
kon
M-1s-1
pHTemp
°C
S-100 protein beta chain
(Homo sapiens (Human))
BDBM50429680
(CHEMBL2335384)
Show SMILES Nc1cc(ccc1N1CCCCC1)N1CCCCC1
Show InChI InChI=1S/C16H25N3/c17-15-13-14(18-9-3-1-4-10-18)7-8-16(15)19-11-5-2-6-12-19/h7-8,13H,1-6,9-12,17H2
Reactome pathway
2.51E+4n/an/an/an/an/an/an/an/a
The University of Tokyo
Curated by ChEMBL
Assay Description
Inhibition of human S100B/human TAMRA-p53(367-388) interaction by fluorescence polarization assay
Bioorg Med Chem 21: 1109-15 (2013)
Article DOI: 10.1016/j.bmc.2012.12.042
BindingDB Entry DOI: 10.7270/Q21C1Z6C
S-100 protein beta chain
(Homo sapiens (Human))
BDBM50429680
(CHEMBL2335384)
Show SMILES Nc1cc(ccc1N1CCCCC1)N1CCCCC1
Show InChI InChI=1S/C16H25N3/c17-15-13-14(18-9-3-1-4-10-18)7-8-16(15)19-11-5-2-6-12-19/h7-8,13H,1-6,9-12,17H2
Reactome pathway
n/an/a 3.15E+4n/an/an/an/an/an/a
The University of Tokyo
Curated by ChEMBL
Assay Description
Inhibition of human S100B/human TAMRA-p53(367-388) interaction by fluorescence polarization assay
Bioorg Med Chem 21: 1109-15 (2013)
Article DOI: 10.1016/j.bmc.2012.12.042
BindingDB Entry DOI: 10.7270/Q21C1Z6C