BDBM50430956 CHEMBL2337405
SMILES: Cc1c(CCOCCCO[N+]([O-])=O)cc(-c2ccc(cc2)S(C)(=O)=O)n1-c1cccc(F)c1
InChI Key: InChIKey=QHWLRGSKZMWYAD-UHFFFAOYSA-N
Data: 2 IC50
Activity Spreadsheet -- Enzyme Inhibition Constant Data from BindingDB
Found 2 hits for monomerid = 50430956
Trg + Lig
Ki
nM
ΔG°
kcal/mole
IC50
nM
Kd
nM
EC50/IC50
nM
koff
s-1
kon
M-1s-1
pHTemp
°C
Prostaglandin G/H synthase (cyclooxygenase)
(Mus musculus)
BDBM50430956
(CHEMBL2337405)
Show SMILES Cc1c(CCOCCCO[N+]([O-])=O)cc(-c2ccc(cc2)S(C)(=O)=O)n1-c1cccc(F)c1
Show InChI InChI=1S/C23H25FN2O6S/c1-17-19(11-14-31-12-4-13-32-26(27)28)15-23(25(17)21-6-3-5-20(24)16-21)18-7-9-22(10-8-18)33(2,29)30/h3,5-10,15-16H,4,11-14H2,1-2H3
Reactome pathway
n/an/a 2.90E+3n/an/an/an/an/an/a
Universit£ degli Studi di Siena
Curated by ChEMBL
Assay Description
Inhibition of arachidonic acid-induced COX1 activity in mouse J774 cells assessed as decrease in PGE2 levels incubated for 15 mins prior to arachidon...
J Med Chem 56: 3191-206 (2013)
Article DOI: 10.1021/jm301370e
BindingDB Entry DOI: 10.7270/Q2JS9RSB
Cyclooxygenase-2 (COX-2)
(Mus musculus (Mouse))
BDBM50430956
(CHEMBL2337405)
Show SMILES Cc1c(CCOCCCO[N+]([O-])=O)cc(-c2ccc(cc2)S(C)(=O)=O)n1-c1cccc(F)c1
Show InChI InChI=1S/C23H25FN2O6S/c1-17-19(11-14-31-12-4-13-32-26(27)28)15-23(25(17)21-6-3-5-20(24)16-21)18-7-9-22(10-8-18)33(2,29)30/h3,5-10,15-16H,4,11-14H2,1-2H3
n/an/a 23n/an/an/an/an/an/a
Universit£ degli Studi di Siena
Curated by ChEMBL
Assay Description
Inhibition of Escherichia coli lipopolysaccharide-induced COX2 activity in mouse J774 cells assessed as decrease in PGE2 levels after 24 hrs by RIA
J Med Chem 56: 3191-206 (2013)
Article DOI: 10.1021/jm301370e
BindingDB Entry DOI: 10.7270/Q2JS9RSB