BDBM50431096 CHEMBL2332055
SMILES: CC(C)(C)C(=O)NCCC1CCN(CC1)c1ncnc2cc(sc12)C(N)=O
InChI Key: InChIKey=NSPKBHVNVJWICU-UHFFFAOYSA-N
Data: 9 IC50
PDB links: 1 PDB ID matches this monomer.
Activity Spreadsheet -- Enzyme Inhibition Constant Data from BindingDB
Found 9 hits for monomerid = 50431096
Trg + Lig
Ki
nM
ΔG°
kcal/mole
IC50
nM
Kd
nM
EC50/IC50
nM
koff
s-1
kon
M-1s-1
pHTemp
°C
Cytochrome P450 2C9
(Homo sapiens (Human))
BDBM50431096
(CHEMBL2332055)
Show SMILES CC(C)(C)C(=O)NCCC1CCN(CC1)c1ncnc2cc(sc12)C(N)=O
Show InChI InChI=1S/C19H27N5O2S/c1-19(2,3)18(26)21-7-4-12-5-8-24(9-6-12)17-15-13(22-11-23-17)10-14(27-15)16(20)25/h10-12H,4-9H2,1-3H3,(H2,20,25)(H,21,26)
Reactome pathway
n/an/a 7.20E+3n/an/an/an/an/an/a
Sirtris a GSK Company
Curated by ChEMBL
Assay Description
Inhibition of CYP2C9 (unknown origin)
J Med Chem 56: 3666-79 (2013)
Article DOI: 10.1021/jm400204k
BindingDB Entry DOI: 10.7270/Q2D50P9C
Cytochrome P450 3A4
(Homo sapiens (Human))
BDBM50431096
(CHEMBL2332055)
Show SMILES CC(C)(C)C(=O)NCCC1CCN(CC1)c1ncnc2cc(sc12)C(N)=O
Show InChI InChI=1S/C19H27N5O2S/c1-19(2,3)18(26)21-7-4-12-5-8-24(9-6-12)17-15-13(22-11-23-17)10-14(27-15)16(20)25/h10-12H,4-9H2,1-3H3,(H2,20,25)(H,21,26)
Reactome pathway
n/an/a>5.00E+4n/an/an/an/an/an/a
Sirtris a GSK Company
Curated by ChEMBL
Assay Description
Inhibition of CYP3A4 (unknown origin)
J Med Chem 56: 3666-79 (2013)
Article DOI: 10.1021/jm400204k
BindingDB Entry DOI: 10.7270/Q2D50P9C
Cytochrome P450 2D6
(Homo sapiens (Human))
BDBM50431096
(CHEMBL2332055)
Show SMILES CC(C)(C)C(=O)NCCC1CCN(CC1)c1ncnc2cc(sc12)C(N)=O
Show InChI InChI=1S/C19H27N5O2S/c1-19(2,3)18(26)21-7-4-12-5-8-24(9-6-12)17-15-13(22-11-23-17)10-14(27-15)16(20)25/h10-12H,4-9H2,1-3H3,(H2,20,25)(H,21,26)
n/an/a>5.00E+4n/an/an/an/an/an/a
Sirtris a GSK Company
Curated by ChEMBL
Assay Description
Inhibition of CYP2D6 (unknown origin)
J Med Chem 56: 3666-79 (2013)
Article DOI: 10.1021/jm400204k
BindingDB Entry DOI: 10.7270/Q2D50P9C
Cytochrome P450 2C19
(Homo sapiens (Human))
BDBM50431096
(CHEMBL2332055)
Show SMILES CC(C)(C)C(=O)NCCC1CCN(CC1)c1ncnc2cc(sc12)C(N)=O
Show InChI InChI=1S/C19H27N5O2S/c1-19(2,3)18(26)21-7-4-12-5-8-24(9-6-12)17-15-13(22-11-23-17)10-14(27-15)16(20)25/h10-12H,4-9H2,1-3H3,(H2,20,25)(H,21,26)
Reactome pathway
n/an/a>5.00E+4n/an/an/an/an/an/a
Sirtris a GSK Company
Curated by ChEMBL
Assay Description
Inhibition of CYP2C19 (unknown origin)
J Med Chem 56: 3666-79 (2013)
Article DOI: 10.1021/jm400204k
BindingDB Entry DOI: 10.7270/Q2D50P9C
NAD-Dependent Deacetylase Sirtuin-1
(Homo sapiens (Human))
BDBM50431096
(CHEMBL2332055)
Show SMILES CC(C)(C)C(=O)NCCC1CCN(CC1)c1ncnc2cc(sc12)C(N)=O
Show InChI InChI=1S/C19H27N5O2S/c1-19(2,3)18(26)21-7-4-12-5-8-24(9-6-12)17-15-13(22-11-23-17)10-14(27-15)16(20)25/h10-12H,4-9H2,1-3H3,(H2,20,25)(H,21,26)
NCI pathway
Reactome pathway
n/an/a 15n/an/an/an/an/an/a
Sirtris a GSK Company
Curated by ChEMBL
Assay Description
Inhibition of His-tagged SIRT1 (1 to 747) (unknown origin)-mediated deacetylation of Ac-RHKKAcW-NH2 substrate preincubated for 20 mins measured after...
J Med Chem 56: 3666-79 (2013)
Article DOI: 10.1021/jm400204k
BindingDB Entry DOI: 10.7270/Q2D50P9C
Potassium voltage-gated channel subfamily H member 2
(Homo sapiens (Human))
BDBM50431096
(CHEMBL2332055)
Show SMILES CC(C)(C)C(=O)NCCC1CCN(CC1)c1ncnc2cc(sc12)C(N)=O
Show InChI InChI=1S/C19H27N5O2S/c1-19(2,3)18(26)21-7-4-12-5-8-24(9-6-12)17-15-13(22-11-23-17)10-14(27-15)16(20)25/h10-12H,4-9H2,1-3H3,(H2,20,25)(H,21,26)
Reactome pathway
n/an/a>5.00E+4n/an/an/an/an/an/a
Sirtris a GSK Company
Curated by ChEMBL
Assay Description
Inhibition of human ERG by dofetilide binding assay
J Med Chem 56: 3666-79 (2013)
Article DOI: 10.1021/jm400204k
BindingDB Entry DOI: 10.7270/Q2D50P9C
NAD-dependent protein deacetylase sirtuin-3 (SIRT3)
(Homo sapiens (Human))
BDBM50431096
(CHEMBL2332055)
Show SMILES CC(C)(C)C(=O)NCCC1CCN(CC1)c1ncnc2cc(sc12)C(N)=O
Show InChI InChI=1S/C19H27N5O2S/c1-19(2,3)18(26)21-7-4-12-5-8-24(9-6-12)17-15-13(22-11-23-17)10-14(27-15)16(20)25/h10-12H,4-9H2,1-3H3,(H2,20,25)(H,21,26)
n/an/a 33n/an/an/an/an/an/a
Sirtris a GSK Company
Curated by ChEMBL
Assay Description
Inhibition of human His-tagged SIRT3 (102 to 399) expressed in Escherichia coli BL21(DE3) assessed as inhibition of deacetylation of Ac-RHKKAcW-NH2 s...
J Med Chem 56: 3666-79 (2013)
Article DOI: 10.1021/jm400204k
BindingDB Entry DOI: 10.7270/Q2D50P9C
3D
3D Structure (crystal)
NAD-dependent deacetylase sirtuin 2
(Homo sapiens (Human))
BDBM50431096
(CHEMBL2332055)
Show SMILES CC(C)(C)C(=O)NCCC1CCN(CC1)c1ncnc2cc(sc12)C(N)=O
Show InChI InChI=1S/C19H27N5O2S/c1-19(2,3)18(26)21-7-4-12-5-8-24(9-6-12)17-15-13(22-11-23-17)10-14(27-15)16(20)25/h10-12H,4-9H2,1-3H3,(H2,20,25)(H,21,26)
NCI pathway
n/an/a 10n/an/an/an/an/an/a
Sirtris a GSK Company
Curated by ChEMBL
Assay Description
Inhibition of His-tagged SIRT2 (1 to 389) (unknown origin)-mediated deacetylation of Ac-RHKKAcW-NH2 substrate incubated for 20 mins prior to substrat...
J Med Chem 56: 3666-79 (2013)
Article DOI: 10.1021/jm400204k
BindingDB Entry DOI: 10.7270/Q2D50P9C
Cytochrome P450 1A
(Homo sapiens (Human))
BDBM50431096
(CHEMBL2332055)
Show SMILES CC(C)(C)C(=O)NCCC1CCN(CC1)c1ncnc2cc(sc12)C(N)=O
Show InChI InChI=1S/C19H27N5O2S/c1-19(2,3)18(26)21-7-4-12-5-8-24(9-6-12)17-15-13(22-11-23-17)10-14(27-15)16(20)25/h10-12H,4-9H2,1-3H3,(H2,20,25)(H,21,26)
Reactome pathway
n/an/a>5.00E+4n/an/an/an/an/an/a
Sirtris a GSK Company
Curated by ChEMBL
Assay Description
Inhibition of CYP1A2 (unknown origin)
J Med Chem 56: 3666-79 (2013)
Article DOI: 10.1021/jm400204k
BindingDB Entry DOI: 10.7270/Q2D50P9C