BDBM50432165 CHEMBL2346770
SMILES: Clc1cccc(NC(=O)NCCC(c2ccccc2)c2ccccc2)c1
InChI Key: InChIKey=WAOBGFCVVZXVFP-UHFFFAOYSA-N
Data: 1 EC50
Activity Spreadsheet -- Enzyme Inhibition Constant Data from BindingDB
Found 1 hit for monomerid = 50432165
Trg + Lig
Ki
nM
ΔG°
kcal/mole
IC50
nM
Kd
nM
EC50/IC50
nM
koff
s-1
kon
M-1s-1
pHTemp
°C
Calcium-sensing receptor (CaSR)
(Homo sapiens (Human))
BDBM50432165
(CHEMBL2346770)
Show SMILES Clc1cccc(NC(=O)NCCC(c2ccccc2)c2ccccc2)c1
Show InChI InChI=1S/C22H21ClN2O/c23-19-12-7-13-20(16-19)25-22(26)24-15-14-21(17-8-3-1-4-9-17)18-10-5-2-6-11-18/h1-13,16,21H,14-15H2,(H2,24,25,26)
n/an/an/an/a 4.00E+3n/an/an/an/a
Galapagos SASU
Curated by ChEMBL
Assay Description
Positive allosteric modulation of human CaSR transfected in CHO cells after 5 hrs by luciferase reporter gene assay
Bioorg Med Chem Lett 23: 2451-4 (2013)
Article DOI: 10.1016/j.bmcl.2013.01.078
BindingDB Entry DOI: 10.7270/Q2930VJZ