BDBM50432475 CHEMBL2349362
SMILES: O=C(CCC1CCCCC1)Nc1cc(NS(=O)(=O)c2cccs2)cc(c1)-c1csc(=O)[nH]1
InChI Key: InChIKey=WAUBHBSWJBQJEK-UHFFFAOYSA-N
Data: 1 IC50
PDB links: 1 PDB ID matches this monomer.
Activity Spreadsheet -- Enzyme Inhibition Constant Data from BindingDB
Found 1 hit for monomerid = 50432475
Trg + Lig
Ki
nM
ΔG°
kcal/mole
IC50
nM
Kd
nM
EC50/IC50
nM
koff
s-1
kon
M-1s-1
pHTemp
°C
Bromodomain-containing protein 4
(Homo sapiens (Human))
BDBM50432475
(CHEMBL2349362)
Show SMILES O=C(CCC1CCCCC1)Nc1cc(NS(=O)(=O)c2cccs2)cc(c1)-c1csc(=O)[nH]1
Show InChI InChI=1S/C22H25N3O4S3/c26-20(9-8-15-5-2-1-3-6-15)23-17-11-16(19-14-31-22(27)24-19)12-18(13-17)25-32(28,29)21-7-4-10-30-21/h4,7,10-15,25H,1-3,5-6,8-9H2,(H,23,26)(H,24,27)
n/an/a 2.20E+3n/an/an/an/an/an/a
Chinese Academy of Sciences
Curated by ChEMBL
Assay Description
Displacement of FITC-labeled (+)-JQ1 from bromodomain BRD4(1) (unknown origin) expressed in Escherichia coli BL21(DE3) after 4 hrs by fluorescence an...
J Med Chem 56: 3833-51 (2013)
Article DOI: 10.1021/jm301793a
BindingDB Entry DOI: 10.7270/Q2P55PVX
3D
3D Structure (crystal)