null
SMILES: O=C(Nc1nccs1)N(CCC(c1ccccc1)c1ccccc1)CCN1CCOCC1
InChI Key: InChIKey=VXFDNCZLWBUTPK-UHFFFAOYSA-N
Activity Spreadsheet -- Enzyme Inhibition Constant Data from BindingDB
Found 1 hit for monomerid = 50432954
Trg + Lig
Ki
nM
ΔG°
kcal/mole
IC50
nM
Kd
nM
EC50/IC50
nM
koff
s-1
kon
M-1s-1
pHTemp
°C
Extracellular calcium-sensing receptor
(Homo sapiens (Human))
BDBM50432954
(CHEMBL2377731)
Show SMILES O=C(Nc1nccs1)N(CCC(c1ccccc1)c1ccccc1)CCN1CCOCC1
Show InChI InChI=1S/C25H30N4O2S/c30-25(27-24-26-12-20-32-24)29(15-14-28-16-18-31-19-17-28)13-11-23(21-7-3-1-4-8-21)22-9-5-2-6-10-22/h1-10,12,20,23H,11,13-19H2,(H,26,27,30)
n/an/an/an/a 300n/an/an/an/a
Galapagos SASU
Curated by ChEMBL
Assay Description
Positive allosteric modulation of human CaSR expressed in CHO cells assessed as increase in intracellular calcium level after 5 hrs by luciferase rep...
Bioorg Med Chem Lett 23: 2455-9 (2013)
Article DOI: 10.1016/j.bmcl.2013.01.077
BindingDB Entry DOI: 10.7270/Q228090Q