BDBM50434122 CHEMBL1232568
SMILES: Clc1ccc2CC(=O)Nc2c1
InChI Key: InChIKey=CENVPIZOTHULGJ-UHFFFAOYSA-N
Data: 2 IC50
PDB links: 2 PDB IDs match this monomer.
Activity Spreadsheet -- Enzyme Inhibition Constant Data from BindingDB
Found 2 hits for monomerid = 50434122
Trg + Lig
Ki
nM
ΔG°
kcal/mole
IC50
nM
Kd
nM
EC50/IC50
nM
koff
s-1
kon
M-1s-1
pHTemp
°C
Chymase
(Homo sapiens (Human))
BDBM50434122
(CHEMBL1232568)
Show SMILES Clc1ccc2CC(=O)Nc2c1
Show InChI InChI=1S/C8H6ClNO/c9-6-2-1-5-3-8(11)10-7(5)4-6/h1-2,4H,3H2,(H,10,11)
Reactome pathway
n/an/a 4.70E+5n/an/an/an/an/an/a
Boehringer Ingelheim Pharmaceuticals Inc.
Curated by ChEMBL
Assay Description
Inhibition of recombinant human chymase using bis(succinoyl-L-alanyl-L-prolyl-L-phenylalanylamide) as substrate after 1 hr by fluorescence assay
J Med Chem 56: 4465-81 (2013)
Article DOI: 10.1021/jm400138z
BindingDB Entry DOI: 10.7270/Q2C82BPN
3D
3D Structure (crystal)
Cathepsin G
(Homo sapiens (Human))
BDBM50434122
(CHEMBL1232568)
Show SMILES Clc1ccc2CC(=O)Nc2c1
Show InChI InChI=1S/C8H6ClNO/c9-6-2-1-5-3-8(11)10-7(5)4-6/h1-2,4H,3H2,(H,10,11)
NCI pathway
Reactome pathway
n/an/a>1.00E+6n/an/an/an/an/an/a
Boehringer Ingelheim Pharmaceuticals Inc.
Curated by ChEMBL
Assay Description
Inhibition of human cathepsin G using bis(succinoyl-L-alanyl-L-prolyl-L-phenylalanylamide) as substrate after 1 hr by fluorescence assay
J Med Chem 56: 4465-81 (2013)
Article DOI: 10.1021/jm400138z
BindingDB Entry DOI: 10.7270/Q2C82BPN