BDBM50434317 CHEMBL2386567
SMILES: Cn1cnc(c1Sc1ccc(Cl)cc1)-c1ccc(cc1)[C@H]1C[C@@H]1C(N)=O
InChI Key: InChIKey=CNFNNGZQMWPCGR-SJORKVTESA-N
Data: 2 IC50
Activity Spreadsheet -- Enzyme Inhibition Constant Data from BindingDB
Found 2 hits for monomerid = 50434317
Trg + Lig
Ki
nM
ΔG°
kcal/mole
IC50
nM
Kd
nM
EC50/IC50
nM
koff
s-1
kon
M-1s-1
pHTemp
°C
Fatty-acid amide hydrolase 1
(Homo sapiens (Human))
BDBM50434317
(CHEMBL2386567)
Show SMILES Cn1cnc(c1Sc1ccc(Cl)cc1)-c1ccc(cc1)[C@H]1C[C@@H]1C(N)=O |r|
Show InChI InChI=1S/C20H18ClN3OS/c1-24-11-23-18(20(24)26-15-8-6-14(21)7-9-15)13-4-2-12(3-5-13)16-10-17(16)19(22)25/h2-9,11,16-17H,10H2,1H3,(H2,22,25)/t16-,17+/m1/s1
n/an/a 0.800n/an/an/an/an/an/a
Merck Research Laboratories
Curated by ChEMBL
Assay Description
Inhibition of human FAAH expressed in CHO cell lysates assessed as arachidonyl-7-amino-4-methylcoumarin amide hydrolysis to 7-amino 4-methyl coumarin...
ACS Med Chem Lett 4: 509-13 (2013)
Article DOI: 10.1021/ml4000996
BindingDB Entry DOI: 10.7270/Q21R6RWJ
Fatty-acid amide hydrolase 1 (aa 30-579)
(Rattus norvegicus (rat))
BDBM50434317
(CHEMBL2386567)
Show SMILES Cn1cnc(c1Sc1ccc(Cl)cc1)-c1ccc(cc1)[C@H]1C[C@@H]1C(N)=O |r|
Show InChI InChI=1S/C20H18ClN3OS/c1-24-11-23-18(20(24)26-15-8-6-14(21)7-9-15)13-4-2-12(3-5-13)16-10-17(16)19(22)25/h2-9,11,16-17H,10H2,1H3,(H2,22,25)/t16-,17+/m1/s1
n/an/a 1.70n/an/an/an/an/an/a
Merck Research Laboratories
Curated by ChEMBL
Assay Description
Inhibition of rat FAAH expressed in CHO cell lysates assessed as arachidonyl-7-amino-4-methylcoumarin amide hydrolysis to 7-amino 4-methyl coumarin p...
ACS Med Chem Lett 4: 509-13 (2013)
Article DOI: 10.1021/ml4000996
BindingDB Entry DOI: 10.7270/Q21R6RWJ