BDBM50436691 CHEMBL2398657
SMILES: CN(C)CCOc1ccc(cc1)-c1cc2c(NCCc3ccc(NC(=O)Nc4ccccc4)cc3)ncnc2o1
InChI Key: InChIKey=GJFJLQXYFZSVOD-UHFFFAOYSA-N
Data: 2 IC50
PDB links: 1 PDB ID matches this monomer.
Activity Spreadsheet -- Enzyme Inhibition Constant Data from BindingDB
Found 2 hits for monomerid = 50436691
Trg + Lig
Ki
nM
ΔG°
kcal/mole
IC50
nM
Kd
nM
EC50/IC50
nM
koff
s-1
kon
M-1s-1
pHTemp
°C
Aurora kinase A
(Homo sapiens (Human))
BDBM50436691
(CHEMBL2398657)
Show SMILES CN(C)CCOc1ccc(cc1)-c1cc2c(NCCc3ccc(NC(=O)Nc4ccccc4)cc3)ncnc2o1
Show InChI InChI=1S/C31H32N6O3/c1-37(2)18-19-39-26-14-10-23(11-15-26)28-20-27-29(33-21-34-30(27)40-28)32-17-16-22-8-12-25(13-9-22)36-31(38)35-24-6-4-3-5-7-24/h3-15,20-21H,16-19H2,1-2H3,(H,32,33,34)(H2,35,36,38)
NCI pathway
Reactome pathway
n/an/a 24n/an/an/an/an/an/a
National Health Research Institutes
Curated by ChEMBL
Assay Description
Inhibition of Aurora kinase A (unknown origin)
J Med Chem 56: 5247-60 (2014)
Article DOI: 10.1021/jm4006059
BindingDB Entry DOI: 10.7270/Q2J104K6
3D
3D Structure (crystal)
Aurora kinase B
(Homo sapiens (Human))
BDBM50436691
(CHEMBL2398657)
Show SMILES CN(C)CCOc1ccc(cc1)-c1cc2c(NCCc3ccc(NC(=O)Nc4ccccc4)cc3)ncnc2o1
Show InChI InChI=1S/C31H32N6O3/c1-37(2)18-19-39-26-14-10-23(11-15-26)28-20-27-29(33-21-34-30(27)40-28)32-17-16-22-8-12-25(13-9-22)36-31(38)35-24-6-4-3-5-7-24/h3-15,20-21H,16-19H2,1-2H3,(H,32,33,34)(H2,35,36,38)
Reactome pathway
n/an/a 53n/an/an/an/an/an/a
National Health Research Institutes
Curated by ChEMBL
Assay Description
Inhibition of Aurora kinase B (unknown origin)
J Med Chem 56: 5247-60 (2014)
Article DOI: 10.1021/jm4006059
BindingDB Entry DOI: 10.7270/Q2J104K6