BDBM50437461 CHEMBL2409462
SMILES: CCCCOC(=O)COc1cc(O)c2c(c1)oc(cc2=O)-c1ccc2OCCOc2c1
InChI Key: InChIKey=VSIHRKWPBRVRCW-UHFFFAOYSA-N
Data: 1 IC50
Activity Spreadsheet -- Enzyme Inhibition Constant Data from BindingDB
Found 1 hit for monomerid = 50437461
Trg + Lig
Ki
nM
ΔG°
kcal/mole
IC50
nM
Kd
nM
EC50/IC50
nM
koff
s-1
kon
M-1s-1
pHTemp
°C
Aldose reductase (ALR2)
(Bos taurus (Cattle))
BDBM50437461
(CHEMBL2409462)
Show SMILES CCCCOC(=O)COc1cc(O)c2c(c1)oc(cc2=O)-c1ccc2OCCOc2c1
Show InChI InChI=1S/C23H22O8/c1-2-3-6-29-22(26)13-30-15-10-16(24)23-17(25)12-19(31-21(23)11-15)14-4-5-18-20(9-14)28-8-7-27-18/h4-5,9-12,24H,2-3,6-8,13H2,1H3
n/an/a 523n/an/an/an/an/an/a
Xiangtan University
Curated by ChEMBL
Assay Description
Inhibition of bovine lens aldose reductase using DL-glyceraldehyde as substrate assessed as NADPH oxidation measured for 10 mins by spectrophotometri...
Bioorg Med Chem 21: 4301-10 (2013)
Article DOI: 10.1016/j.bmc.2013.04.066
BindingDB Entry DOI: 10.7270/Q2BZ67GT