BDBM50437867 CHEMBL2407904
SMILES: COc1cc(\C=C2/C(=O)N(C)c3ccc(Br)cc23)cc(Cl)c1O
InChI Key: InChIKey=GKBCILCXUSENIW-XGICHPGQSA-N
Data: 2 IC50
Activity Spreadsheet -- Enzyme Inhibition Constant Data from BindingDB
Found 2 hits for monomerid = 50437867
Trg + Lig
Ki
nM
ΔG°
kcal/mole
IC50
nM
Kd
nM
EC50/IC50
nM
koff
s-1
kon
M-1s-1
pHTemp
°C
Serine/threonine-protein kinase PLK4
(Homo sapiens (Human))
BDBM50437867
(CHEMBL2407904)
Show SMILES COc1cc(\C=C2/C(=O)N(C)c3ccc(Br)cc23)cc(Cl)c1O
Show InChI InChI=1S/C17H13BrClNO3/c1-20-14-4-3-10(18)8-11(14)12(17(20)22)5-9-6-13(19)16(21)15(7-9)23-2/h3-8,21H,1-2H3/b12-5-
NCI pathway
Reactome pathway
n/an/a 6.10E+3n/an/an/an/an/an/a
EntreMed Inc.
Curated by ChEMBL
Assay Description
Inhibition of N-terminal GST-tagged human PLK4 (1 to 391 amino acids) expressed in Escherichia coli using TMB as substrate after 30 mins by indirect ...
J Med Chem 56: 6069-87 (2013)
Article DOI: 10.1021/jm400380m
BindingDB Entry DOI: 10.7270/Q2HM59V9
Serine/threonine-protein kinase PLK1
(Homo sapiens (Human))
BDBM50437867
(CHEMBL2407904)
Show SMILES COc1cc(\C=C2/C(=O)N(C)c3ccc(Br)cc23)cc(Cl)c1O
Show InChI InChI=1S/C17H13BrClNO3/c1-20-14-4-3-10(18)8-11(14)12(17(20)22)5-9-6-13(19)16(21)15(7-9)23-2/h3-8,21H,1-2H3/b12-5-
NCI pathway
Reactome pathway
n/an/a>1.00E+4n/an/an/an/an/an/a
EntreMed Inc.
Curated by ChEMBL
Assay Description
Inhibition of PLK1 (unknown origin) by FRET-based homogeneous assay
J Med Chem 56: 6069-87 (2013)
Article DOI: 10.1021/jm400380m
BindingDB Entry DOI: 10.7270/Q2HM59V9