BDBM50439432 CHEMBL2420703
SMILES: Cn1cc(c(n1)-c1ccc(F)cc1)-c1ccnc2CNCCOc12
InChI Key: InChIKey=RDUXJEGWTNOYDA-UHFFFAOYSA-N
Data: 3 IC50
PDB links: 1 PDB ID matches this monomer.
Activity Spreadsheet -- Enzyme Inhibition Constant Data from BindingDB
Found 3 hits for monomerid = 50439432
Trg + Lig
Ki
nM
ΔG°
kcal/mole
IC50
nM
Kd
nM
EC50/IC50
nM
koff
s-1
kon
M-1s-1
pHTemp
°C
Casein kinase I isoform delta
(Homo sapiens (Human))
BDBM50439432
(CHEMBL2420703)
Show SMILES Cn1cc(c(n1)-c1ccc(F)cc1)-c1ccnc2CNCCOc12
Show InChI InChI=1S/C18H17FN4O/c1-23-11-15(17(22-23)12-2-4-13(19)5-3-12)14-6-7-21-16-10-20-8-9-24-18(14)16/h2-7,11,20H,8-10H2,1H3
n/an/a 42n/an/an/an/an/an/a
Pfizer Inc.
Curated by ChEMBL
Assay Description
Inhibition of human CK1 delta transfected in african green monkey cos7 cells after overnight incubation by whole cell assay
J Med Chem 56: 6819-28 (2013)
Article DOI: 10.1021/jm4006324
BindingDB Entry DOI: 10.7270/Q2125V36
3D
3D Structure (crystal)
Casein kinase I isoform delta
(Homo sapiens (Human))
BDBM50439432
(CHEMBL2420703)
Show SMILES Cn1cc(c(n1)-c1ccc(F)cc1)-c1ccnc2CNCCOc12
Show InChI InChI=1S/C18H17FN4O/c1-23-11-15(17(22-23)12-2-4-13(19)5-3-12)14-6-7-21-16-10-20-8-9-24-18(14)16/h2-7,11,20H,8-10H2,1H3
n/an/a 6n/an/an/an/an/an/a
Pfizer Inc.
Curated by ChEMBL
Assay Description
Inhibition of CK1 delta (unknown origin) using PLSRTLpSVASLPGL as substrate after 60 mins by microplate reader analysis
J Med Chem 56: 6819-28 (2013)
Article DOI: 10.1021/jm4006324
BindingDB Entry DOI: 10.7270/Q2125V36
3D
3D Structure (crystal)
Casein kinase I isoform epsilon
(Homo sapiens (Human))
BDBM50439432
(CHEMBL2420703)
Show SMILES Cn1cc(c(n1)-c1ccc(F)cc1)-c1ccnc2CNCCOc12
Show InChI InChI=1S/C18H17FN4O/c1-23-11-15(17(22-23)12-2-4-13(19)5-3-12)14-6-7-21-16-10-20-8-9-24-18(14)16/h2-7,11,20H,8-10H2,1H3
n/an/a 27n/an/an/an/an/an/a
Pfizer Inc.
Curated by ChEMBL
Assay Description
Inhibition of CK1 epsilon (unknown origin) using PLSRTLpSVASLPGL as substrate after 85 mins by microplate reader analysis
J Med Chem 56: 6819-28 (2013)
Article DOI: 10.1021/jm4006324
BindingDB Entry DOI: 10.7270/Q2125V36
3D
3D Structure (crystal)