BDBM50440880 CHEMBL2431836
SMILES: CC(C)Nc1ccc2nnc([C@@H](C)c3ccc4ncccc4c3)n2n1
InChI Key: InChIKey=LLYNUJHWODYAPQ-ZDUSSCGKSA-N
Data: 1 KI  1 IC50
Activity Spreadsheet -- Enzyme Inhibition Constant Data from BindingDB
Found 2 hits for monomerid = 50440880
Trg + Lig
Ki
nM
ΔG°
kcal/mole
IC50
nM
Kd
nM
EC50/IC50
nM
koff
s-1
kon
M-1s-1
pHTemp
°C
Hepatocyte growth factor receptor
(Homo sapiens (Human))
BDBM50440880
(CHEMBL2431836)
Show SMILES CC(C)Nc1ccc2nnc([C@@H](C)c3ccc4ncccc4c3)n2n1 |r|
Show InChI InChI=1S/C19H20N6/c1-12(2)21-17-8-9-18-22-23-19(25(18)24-17)13(3)14-6-7-16-15(11-14)5-4-10-20-16/h4-13H,1-3H3,(H,21,24)/t13-/m0/s1
7n/an/an/an/an/an/an/an/a
Pfizer Inc.
Curated by ChEMBL
Assay Description
Inhibition of N-terminal His-6-tagged human recombinant c-Met (974 to 1390) using Ac-ARDMYDKEYYSVHNK as substrate by spectrophotometric assay
J Med Chem 56: 6651-65 (2013)
Article DOI: 10.1021/jm400926x
BindingDB Entry DOI: 10.7270/Q2HM59WR
Hepatocyte growth factor receptor
(Homo sapiens (Human))
BDBM50440880
(CHEMBL2431836)
Show SMILES CC(C)Nc1ccc2nnc([C@@H](C)c3ccc4ncccc4c3)n2n1 |r|
Show InChI InChI=1S/C19H20N6/c1-12(2)21-17-8-9-18-22-23-19(25(18)24-17)13(3)14-6-7-16-15(11-14)5-4-10-20-16/h4-13H,1-3H3,(H,21,24)/t13-/m0/s1
n/an/a 23n/an/an/an/an/an/a
Pfizer Inc.
Curated by ChEMBL
Assay Description
Inhibition of c-Met autophosphorylation in human A549 cells after 1 hr by ELISA
J Med Chem 56: 6651-65 (2013)
Article DOI: 10.1021/jm400926x
BindingDB Entry DOI: 10.7270/Q2HM59WR