BDBM50441759 CHEMBL2436009
SMILES: CC(=O)Nc1cccc(c1)-c1cc(C)[n+]([O-])c2ccccc12
InChI Key: InChIKey=YSGOTUAMXVUKOD-UHFFFAOYSA-N
Data: 1 IC50
PDB links: 1 PDB ID matches this monomer.
Activity Spreadsheet -- Enzyme Inhibition Constant Data from BindingDB
Found 1 hit for monomerid = 50441759
Trg + Lig
Ki
nM
ΔG°
kcal/mole
IC50
nM
Kd
nM
EC50/IC50
nM
koff
s-1
kon
M-1s-1
pHTemp
°C
Bromodomain-containing protein 4
(Homo sapiens (Human))
BDBM50441759
(CHEMBL2436009)
Show SMILES CC(=O)Nc1cccc(c1)-c1cc(C)[n+]([O-])c2ccccc12
Show InChI InChI=1S/C18H16N2O2/c1-12-10-17(16-8-3-4-9-18(16)20(12)22)14-6-5-7-15(11-14)19-13(2)21/h3-11H,1-2H3,(H,19,21)
n/an/a 4.20E+4n/an/an/an/an/an/a
The Institute of Cancer Research
Curated by ChEMBL
Assay Description
Inhibition of His-tagged first bromodomain of BRD4 (unknown origin) using H-SGRGK(Ac)GGK(Ac)GLGK-(Ac)GGAK(Ac)RHRK(Biotin)-OH as substrate preincubate...
J Med Chem 56: 8073-88 (2013)
Article DOI: 10.1021/jm4011302
BindingDB Entry DOI: 10.7270/Q20C4X6S
3D
3D Structure (crystal)