BDBM50442401 CHEMBL2442947
SMILES: [#6]\[#6](-[#6])=[#6]\[#6]-c1c(-[#8])c(-[#6]\[#6]=[#6](\[#6])-[#6])c2occ(-c3ccc(-[#8])c(-[#8])c3)c(=O)c2c1-[#8]
InChI Key: InChIKey=OAUIRSVJXOFAOO-UHFFFAOYSA-N
Data: 2 KI  2 IC50
Activity Spreadsheet -- Enzyme Inhibition Constant Data from BindingDB
Found 4 hits for monomerid = 50442401
Trg + Lig
Ki
nM
ΔG°
kcal/mole
IC50
nM
Kd
nM
EC50/IC50
nM
koff
s-1
kon
M-1s-1
pHTemp
°C
Sialidase
(Clostridium perfringens)
BDBM50442401
(CHEMBL2442947)
Show SMILES [#6]\[#6](-[#6])=[#6]\[#6]-c1c(-[#8])c(-[#6]\[#6]=[#6](\[#6])-[#6])c2occ(-c3ccc(-[#8])c(-[#8])c3)c(=O)c2c1-[#8]
Show InChI InChI=1S/C25H26O6/c1-13(2)5-8-16-22(28)17(9-6-14(3)4)25-21(23(16)29)24(30)18(12-31-25)15-7-10-19(26)20(27)11-15/h5-7,10-12,26-29H,8-9H2,1-4H3
1.02E+3n/an/an/an/an/an/an/an/a
Graduate School of Gyeongsang National University
Curated by ChEMBL
Assay Description
Non-competitive inhibition of Clostridium perfringens neuraminidase using 4-methylumbelliferyl-alpha-D-N-acetylneuraminic acid sodium salt hydrate as...
Bioorg Med Chem 21: 6398-404 (2013)
Article DOI: 10.1016/j.bmc.2013.08.049
BindingDB Entry DOI: 10.7270/Q2Z89DVN
Protein-tyrosine phosphatase 1B
(Homo sapiens (Human))
BDBM50442401
(CHEMBL2442947)
Show SMILES [#6]\[#6](-[#6])=[#6]\[#6]-c1c(-[#8])c(-[#6]\[#6]=[#6](\[#6])-[#6])c2occ(-c3ccc(-[#8])c(-[#8])c3)c(=O)c2c1-[#8]
Show InChI InChI=1S/C25H26O6/c1-13(2)5-8-16-22(28)17(9-6-14(3)4)25-21(23(16)29)24(30)18(12-31-25)15-7-10-19(26)20(27)11-15/h5-7,10-12,26-29H,8-9H2,1-4H3
NCI pathway
Reactome pathway
2.50E+3n/an/an/an/an/an/an/an/a
Qiqihar University
Curated by ChEMBL
Assay Description
Non-competitive inhibition of human recombinant PTP1B using p-nitrophenyl phosphate as substrate by spectrophotometry based Lineweaver-Burk plot
Bioorg Med Chem Lett 26: 318-21 (2016)
BindingDB Entry DOI: 10.7270/Q2C82C4W
Protein-tyrosine phosphatase 1B
(Homo sapiens (Human))
BDBM50442401
(CHEMBL2442947)
Show SMILES [#6]\[#6](-[#6])=[#6]\[#6]-c1c(-[#8])c(-[#6]\[#6]=[#6](\[#6])-[#6])c2occ(-c3ccc(-[#8])c(-[#8])c3)c(=O)c2c1-[#8]
Show InChI InChI=1S/C25H26O6/c1-13(2)5-8-16-22(28)17(9-6-14(3)4)25-21(23(16)29)24(30)18(12-31-25)15-7-10-19(26)20(27)11-15/h5-7,10-12,26-29H,8-9H2,1-4H3
NCI pathway
Reactome pathway
n/an/a 2.40E+3n/an/an/an/an/an/a
Qiqihar University
Curated by ChEMBL
Assay Description
Inhibition of human recombinant PTP1B using p-nitrophenyl phosphate as substrate by spectrophotometric analysis
Bioorg Med Chem Lett 26: 318-21 (2016)
BindingDB Entry DOI: 10.7270/Q2C82C4W
Sialidase
(Clostridium perfringens)
BDBM50442401
(CHEMBL2442947)
Show SMILES [#6]\[#6](-[#6])=[#6]\[#6]-c1c(-[#8])c(-[#6]\[#6]=[#6](\[#6])-[#6])c2occ(-c3ccc(-[#8])c(-[#8])c3)c(=O)c2c1-[#8]
Show InChI InChI=1S/C25H26O6/c1-13(2)5-8-16-22(28)17(9-6-14(3)4)25-21(23(16)29)24(30)18(12-31-25)15-7-10-19(26)20(27)11-15/h5-7,10-12,26-29H,8-9H2,1-4H3
n/an/a 1.07E+3n/an/an/an/an/an/a
Graduate School of Gyeongsang National University
Curated by ChEMBL
Assay Description
Inhibition of Clostridium perfringens neuraminidase using 4-methylumbelliferyl-alpha-D-N-acetylneuraminic acid sodium salt hydrate as substrate by fl...
Bioorg Med Chem 21: 6398-404 (2013)
Article DOI: 10.1016/j.bmc.2013.08.049
BindingDB Entry DOI: 10.7270/Q2Z89DVN