BDBM50442738 CHEMBL2442802
SMILES: COc1cc(cc(OC)c1O)[C@H]1[C@@H]2[C@H](COC2=O)[C@H](Nc2ccccc2OCCCCCCC(=O)NO)c2cc3OCOc3cc12
InChI Key: InChIKey=MANNQXGOGDCTLP-KCZUQOQJSA-N
Data: 1 IC50
Activity Spreadsheet -- Enzyme Inhibition Constant Data from BindingDB
Found 1 hit for monomerid = 50442738
Trg + Lig
Ki
nM
ΔG°
kcal/mole
IC50
nM
Kd
nM
EC50/IC50
nM
koff
s-1
kon
M-1s-1
pHTemp
°C
Histone deacetylase 3
(Homo sapiens (Human))
BDBM50442738
(CHEMBL2442802)
Show SMILES COc1cc(cc(OC)c1O)[C@H]1[C@@H]2[C@H](COC2=O)[C@H](Nc2ccccc2OCCCCCCC(=O)NO)c2cc3OCOc3cc12 |r|
Show InChI InChI=1S/C34H38N2O10/c1-41-27-13-19(14-28(42-2)33(27)38)30-20-15-25-26(46-18-45-25)16-21(20)32(22-17-44-34(39)31(22)30)35-23-9-6-7-10-24(23)43-12-8-4-3-5-11-29(37)36-40/h6-7,9-10,13-16,22,30-32,35,38,40H,3-5,8,11-12,17-18H2,1-2H3,(H,36,37)/t22-,30+,31-,32+/m0/s1
NCI pathway
Reactome pathway
n/an/a 155n/an/an/an/an/an/a
East China Normal University
Curated by ChEMBL
Assay Description
Inhibition of human recombinant HDAC3 expressed in baculovirus infected insect high5 cells using Ac-Lys-Tyr-Lys (epsilon-acetyl)-AMC as substrate aft...
Bioorg Med Chem 21: 6981-95 (2013)
Article DOI: 10.1016/j.bmc.2013.09.023
BindingDB Entry DOI: 10.7270/Q2CC124T