null
SMILES: CCN(CC)CCNS(=O)(=O)Cc1ccc(Cl)cc1
InChI Key: InChIKey=MKQJIDUAXALKCV-UHFFFAOYSA-N
PDB links: 1 PDB ID matches this monomer.
Activity Spreadsheet -- Enzyme Inhibition Constant Data from BindingDB
Found 2 hits for monomerid = 50443030
Trg + Lig
Ki
nM
ΔG°
kcal/mole
IC50
nM
Kd
nM
EC50/IC50
nM
koff
s-1
kon
M-1s-1
pHTemp
°C
Acetylcholinesterase
(Mus musculus (mouse))
BDBM50443030
(CHEMBL3087808)
Show SMILES CCN(CC)CCNS(=O)(=O)Cc1ccc(Cl)cc1
Show InChI InChI=1S/C13H21ClN2O2S/c1-3-16(4-2)10-9-15-19(17,18)11-12-5-7-13(14)8-6-12/h5-8,15H,3-4,9-11H2,1-2H3
Reactome pathway
n/an/a 1.20E+4n/an/an/an/an/an/a
Ume£ University
Curated by ChEMBL
Assay Description
Inhibition of mouse recombinant AChE using acetylthiocholine iodide as substrate by Ellman's method
J Med Chem 56: 7615-24 (2013)
Article DOI: 10.1021/jm400990p
BindingDB Entry DOI: 10.7270/Q24M95Z3
3D
3D Structure (crystal)
Acetylcholinesterase
(Mus musculus (mouse))
BDBM50443030
(CHEMBL3087808)
Show SMILES CCN(CC)CCNS(=O)(=O)Cc1ccc(Cl)cc1
Show InChI InChI=1S/C13H21ClN2O2S/c1-3-16(4-2)10-9-15-19(17,18)11-12-5-7-13(14)8-6-12/h5-8,15H,3-4,9-11H2,1-2H3
Reactome pathway
n/an/an/a 1.11E+4n/an/an/an/an/a
Ume£ University
Curated by ChEMBL
Assay Description
Binding affinity to mouse AChE by isothermal titration calorimetry
J Med Chem 56: 7615-24 (2013)
Article DOI: 10.1021/jm400990p
BindingDB Entry DOI: 10.7270/Q24M95Z3
3D
3D Structure (crystal)