BDBM50443038 CHEMBL1624646
SMILES: CCN(CC)CCNS(=O)(=O)c1ccc(Cl)cc1
InChI Key: InChIKey=KVQQWVRVJDYYMC-UHFFFAOYSA-N
Data: 1 IC50
PDB links: 1 PDB ID matches this monomer.
Activity Spreadsheet -- Enzyme Inhibition Constant Data from BindingDB
Found 1 hit for monomerid = 50443038
Trg + Lig
Ki
nM
ΔG°
kcal/mole
IC50
nM
Kd
nM
EC50/IC50
nM
koff
s-1
kon
M-1s-1
pHTemp
°C
Acetylcholinesterase
(Mus musculus (mouse))
BDBM50443038
(CHEMBL1624646)
Show SMILES CCN(CC)CCNS(=O)(=O)c1ccc(Cl)cc1
Show InChI InChI=1S/C12H19ClN2O2S/c1-3-15(4-2)10-9-14-18(16,17)12-7-5-11(13)6-8-12/h5-8,14H,3-4,9-10H2,1-2H3
Reactome pathway
n/an/a 8.80E+4n/an/an/an/an/an/a
Ume£ University
Curated by ChEMBL
Assay Description
Inhibition of mouse recombinant AChE using acetylthiocholine iodide as substrate by Ellman's method
J Med Chem 56: 7615-24 (2013)
Article DOI: 10.1021/jm400990p
BindingDB Entry DOI: 10.7270/Q24M95Z3
3D
3D Structure (crystal)