BDBM50443510 CHEMBL3087779
SMILES: Cc1nn(C)cc1-c1nc2ncc(Cl)c(N3CCC[C@H](CNS(C)(=O)=O)C3)c2[nH]1
InChI Key: InChIKey=PASPLONSFSXGKA-GFCCVEGCSA-N
Data: 2 IC50
Activity Spreadsheet -- Enzyme Inhibition Constant Data from BindingDB
Found 2 hits for monomerid = 50443510
Trg + Lig
Ki
nM
ΔG°
kcal/mole
IC50
nM
Kd
nM
EC50/IC50
nM
koff
s-1
kon
M-1s-1
pHTemp
°C
Aurora kinase A
(Homo sapiens (Human))
BDBM50443510
(CHEMBL3087779)
Show SMILES Cc1nn(C)cc1-c1nc2ncc(Cl)c(N3CCC[C@H](CNS(C)(=O)=O)C3)c2[nH]1 |r|
Show InChI InChI=1S/C18H24ClN7O2S/c1-11-13(10-25(2)24-11)17-22-15-16(14(19)8-20-18(15)23-17)26-6-4-5-12(9-26)7-21-29(3,27)28/h8,10,12,21H,4-7,9H2,1-3H3,(H,20,22,23)/t12-/m1/s1
NCI pathway
Reactome pathway
n/an/a 5n/an/an/an/an/an/a
The Institute of Cancer Research
Curated by ChEMBL
Assay Description
Inhibition of N-terminal HIS-tagged aurora-A (unknown origin) using 5FAM-LRRASLG-CONH2 as substrate after 60 mins
J Med Chem 56: 9122-35 (2013)
Article DOI: 10.1021/jm401115g
BindingDB Entry DOI: 10.7270/Q2R78GPN
Aurora kinase B
(Homo sapiens (Human))
BDBM50443510
(CHEMBL3087779)
Show SMILES Cc1nn(C)cc1-c1nc2ncc(Cl)c(N3CCC[C@H](CNS(C)(=O)=O)C3)c2[nH]1 |r|
Show InChI InChI=1S/C18H24ClN7O2S/c1-11-13(10-25(2)24-11)17-22-15-16(14(19)8-20-18(15)23-17)26-6-4-5-12(9-26)7-21-29(3,27)28/h8,10,12,21H,4-7,9H2,1-3H3,(H,20,22,23)/t12-/m1/s1
Reactome pathway
n/an/a 8n/an/an/an/an/an/a
The Institute of Cancer Research
Curated by ChEMBL
Assay Description
Inhibition of full-length aurora-B (unknown origin) using 5FAMLRRASLG-CONH2 as substrate after 60 mins
J Med Chem 56: 9122-35 (2013)
Article DOI: 10.1021/jm401115g
BindingDB Entry DOI: 10.7270/Q2R78GPN