BDBM50443783 CHEMBL3094114
SMILES: C(Oc1ccc2CCN(CC3CC3)CCc2c1)c1ccccc1
InChI Key: InChIKey=AQRDKFVOYVDLCT-UHFFFAOYSA-N
Data: 1 KI  1 IC50
Activity Spreadsheet -- Enzyme Inhibition Constant Data from BindingDB
Found 2 hits for monomerid = 50443783
Trg + Lig
Ki
nM
ΔG°
kcal/mole
IC50
nM
Kd
nM
EC50/IC50
nM
koff
s-1
kon
M-1s-1
pHTemp
°C
Histamine H1 receptor
(Homo sapiens (Human))
BDBM50443783
(CHEMBL3094114)
Show SMILES C(Oc1ccc2CCN(CC3CC3)CCc2c1)c1ccccc1
Show InChI InChI=1S/C21H25NO/c1-2-4-18(5-3-1)16-23-21-9-8-19-10-12-22(15-17-6-7-17)13-11-20(19)14-21/h1-5,8-9,14,17H,6-7,10-13,15-16H2
Reactome pathway
1.00E+3n/an/an/an/an/an/an/an/a
GlaxoSmithKline R&D
Curated by ChEMBL
Assay Description
Antagonist activity at human recombinant histamine H1 receptor expressed in CHO cells assessed as inhibition of histamine-induced effect by FLIPR ass...
Bioorg Med Chem Lett 23: 6897-901 (2013)
Article DOI: 10.1016/j.bmcl.2013.09.089
BindingDB Entry DOI: 10.7270/Q2HM59X6
Cytochrome P450 2D6
(Homo sapiens (Human))
BDBM50443783
(CHEMBL3094114)
Show SMILES C(Oc1ccc2CCN(CC3CC3)CCc2c1)c1ccccc1
Show InChI InChI=1S/C21H25NO/c1-2-4-18(5-3-1)16-23-21-9-8-19-10-12-22(15-17-6-7-17)13-11-20(19)14-21/h1-5,8-9,14,17H,6-7,10-13,15-16H2
n/an/a 1.50E+3n/an/an/an/an/an/a
GlaxoSmithKline R&D
Curated by ChEMBL
Assay Description
Inhibition of human CYP2D6
Bioorg Med Chem Lett 23: 6897-901 (2013)
Article DOI: 10.1016/j.bmcl.2013.09.089
BindingDB Entry DOI: 10.7270/Q2HM59X6