BDBM50444153 CHEMBL3093304
SMILES: OC(=O)c1cc(ccc1N1CCC(Cc2ccc(F)cc2)C1)C(F)(F)F
InChI Key: InChIKey=FEMUMJGMWHWYBP-UHFFFAOYSA-N
Data: 2 IC50
Activity Spreadsheet -- Enzyme Inhibition Constant Data from BindingDB
Found 2 hits for monomerid = 50444153
Trg + Lig
Ki
nM
ΔG°
kcal/mole
IC50
nM
Kd
nM
EC50/IC50
nM
koff
s-1
kon
M-1s-1
pHTemp
°C
Endothelial lipase
(Homo sapiens (Human))
BDBM50444153
(CHEMBL3093304)
Show SMILES OC(=O)c1cc(ccc1N1CCC(Cc2ccc(F)cc2)C1)C(F)(F)F
Show InChI InChI=1S/C19H17F4NO2/c20-15-4-1-12(2-5-15)9-13-7-8-24(11-13)17-6-3-14(19(21,22)23)10-16(17)18(25)26/h1-6,10,13H,7-9,11H2,(H,25,26)
n/an/a 25n/an/an/an/an/an/a
Xenon Pharmaceuticals Inc
Curated by ChEMBL
Assay Description
Inhibition of recombinant human endothelial lipase using bis-BODIPY-FL C11-PC as substrate preincubated for 30 mins followed by substrate addition by...
Bioorg Med Chem 21: 7724-34 (2013)
Article DOI: 10.1016/j.bmc.2013.10.023
BindingDB Entry DOI: 10.7270/Q2P55PZ8
Lipoprotein lipase
(Homo sapiens (Human))
BDBM50444153
(CHEMBL3093304)
Show SMILES OC(=O)c1cc(ccc1N1CCC(Cc2ccc(F)cc2)C1)C(F)(F)F
Show InChI InChI=1S/C19H17F4NO2/c20-15-4-1-12(2-5-15)9-13-7-8-24(11-13)17-6-3-14(19(21,22)23)10-16(17)18(25)26/h1-6,10,13H,7-9,11H2,(H,25,26)
Reactome pathway
n/an/a 2.56E+3n/an/an/an/an/an/a
Xenon Pharmaceuticals Inc
Curated by ChEMBL
Assay Description
Inhibition of recombinant human lipoprotein lipase using bis-BODIPY-FL C11-PC as substrate preincubated for 30 mins followed by substrate addition by...
Bioorg Med Chem 21: 7724-34 (2013)
Article DOI: 10.1016/j.bmc.2013.10.023
BindingDB Entry DOI: 10.7270/Q2P55PZ8