BDBM50444385 CHEMBL3094442
SMILES: COC(=O)c1ccc(Cl)c(NC(=O)c2cc3cnc(OC)nc3[nH]c2=O)c1
InChI Key: InChIKey=SIVLENRHVVVPKJ-UHFFFAOYSA-N
Data: 2 IC50
PDB links: 1 PDB ID matches this monomer.
Activity Spreadsheet -- Enzyme Inhibition Constant Data from BindingDB
Found 2 hits for monomerid = 50444385
Trg + Lig
Ki
nM
ΔG°
kcal/mole
IC50
nM
Kd
nM
EC50/IC50
nM
koff
s-1
kon
M-1s-1
pHTemp
°C
Dual-specificity tyrosine-regulated kinases 1B
(Homo sapiens (Human))
BDBM50444385
(CHEMBL3094442)
Show SMILES COC(=O)c1ccc(Cl)c(NC(=O)c2cc3cnc(OC)nc3[nH]c2=O)c1
Show InChI InChI=1S/C17H13ClN4O5/c1-26-16(25)8-3-4-11(18)12(6-8)20-14(23)10-5-9-7-19-17(27-2)22-13(9)21-15(10)24/h3-7H,1-2H3,(H,20,23)(H,19,21,22,24)
n/an/a 134n/an/an/an/an/an/a
Hoffmann-La Roche Inc.
Curated by ChEMBL
Assay Description
Inhibition of DYRK1B (unknown origin)
Bioorg Med Chem Lett 23: 6610-5 (2013)
Article DOI: 10.1016/j.bmcl.2013.10.055
BindingDB Entry DOI: 10.7270/Q20G3MNJ
Dual-specificity tyrosine-phosphorylation regulated kinase 1A
(Homo sapiens (Human))
BDBM50444385
(CHEMBL3094442)
Show SMILES COC(=O)c1ccc(Cl)c(NC(=O)c2cc3cnc(OC)nc3[nH]c2=O)c1
Show InChI InChI=1S/C17H13ClN4O5/c1-26-16(25)8-3-4-11(18)12(6-8)20-14(23)10-5-9-7-19-17(27-2)22-13(9)21-15(10)24/h3-7H,1-2H3,(H,20,23)(H,19,21,22,24)
Reactome pathway
n/an/a 97n/an/an/an/an/an/a
Hoffmann-La Roche Inc.
Curated by ChEMBL
Assay Description
Inhibition of DYRK1A (unknown origin)
Bioorg Med Chem Lett 23: 6610-5 (2013)
Article DOI: 10.1016/j.bmcl.2013.10.055
BindingDB Entry DOI: 10.7270/Q20G3MNJ
3D
3D Structure (crystal)