BDBM50445221 CHEMBL3103624
SMILES: FC(F)(F)Oc1ccc(NC(=O)Nc2ccccc2-c2cc3ccccc3[nH]2)cc1
InChI Key: InChIKey=VBDKDMMEVSHZJM-UHFFFAOYSA-N
Data: 1 IC50
Activity Spreadsheet -- Enzyme Inhibition Constant Data from BindingDB
Found 1 hit for monomerid = 50445221
Trg + Lig
Ki
nM
ΔG°
kcal/mole
IC50
nM
Kd
nM
EC50/IC50
nM
koff
s-1
kon
M-1s-1
pHTemp
°C
Purinergic receptor P2Y1
(Homo sapiens (Human))
BDBM50445221
(CHEMBL3103624)
Show SMILES FC(F)(F)Oc1ccc(NC(=O)Nc2ccccc2-c2cc3ccccc3[nH]2)cc1
Show InChI InChI=1S/C22H16F3N3O2/c23-22(24,25)30-16-11-9-15(10-12-16)26-21(29)28-19-8-4-2-6-17(19)20-13-14-5-1-3-7-18(14)27-20/h1-13,27H,(H2,26,28,29)
n/an/a 75n/an/an/an/an/an/a
Bristol-Myers Squibb Company
Curated by ChEMBL
Assay Description
Displacement of [33P]-2MeS-ADP from human P2Y1 receptor expressed in HEK293 cells after 1 hr by scintillation counting analysis
J Med Chem 56: 9275-95 (2013)
Article DOI: 10.1021/jm4013906
BindingDB Entry DOI: 10.7270/Q2KW5HHP