BDBM50446751 CHEMBL3114403
SMILES: CCOc1ccccc1CN
InChI Key: InChIKey=LAUPTNYHVCVPFH-UHFFFAOYSA-N
Data: 2 IC50
Activity Spreadsheet -- Enzyme Inhibition Constant Data from BindingDB
Found 2 hits for monomerid = 50446751
Trg + Lig
Ki
nM
ΔG°
kcal/mole
IC50
nM
Kd
nM
EC50/IC50
nM
koff
s-1
kon
M-1s-1
pHTemp
°C
Amiloride-sensitive amine oxidase [copper-containing]
(Sus scrofa)
BDBM50446751
(CHEMBL3114403)
Show SMILES CCOc1ccccc1CN
Show InChI InChI=1S/C9H13NO/c1-2-11-9-6-4-3-5-8(9)7-10/h3-6H,2,7,10H2,1H3
n/an/a>1.00E+6n/an/an/an/an/an/a
Universit£ di Genova
Curated by ChEMBL
Assay Description
Inhibition of porcine kidney DAO using [1,4-14C]-putrescine as substrate preincubated for 30 mins followed by substrate addition
Bioorg Med Chem 22: 1558-67 (2014)
Article DOI: 10.1016/j.bmc.2014.01.037
BindingDB Entry DOI: 10.7270/Q2668FNG
Protein-lysine 6-oxidase
(Sus scrofa)
BDBM50446751
(CHEMBL3114403)
Show SMILES CCOc1ccccc1CN
Show InChI InChI=1S/C9H13NO/c1-2-11-9-6-4-3-5-8(9)7-10/h3-6H,2,7,10H2,1H3
n/an/a>1.00E+6n/an/an/an/an/an/a
Universit£ di Genova
Curated by ChEMBL
Assay Description
Inhibition of porcine aorta lysyl oxidase preincubated for 30 mins followed by substrate addition
Bioorg Med Chem 22: 1558-67 (2014)
Article DOI: 10.1016/j.bmc.2014.01.037
BindingDB Entry DOI: 10.7270/Q2668FNG