BDBM50447856 CHEMBL3114755
SMILES: O[C@H]1Cc2c(O)c([C@H]3[C@H](O)[C@H](Oc4cc(O)ccc34)c3ccc(O)c(O)c3)c(O)cc2O[C@@H]1c1ccc(O)c(O)c1
InChI Key: InChIKey=SESBFFBADRRLTM-BUEDJVDESA-N
Data: 1 IC50
Activity Spreadsheet -- Enzyme Inhibition Constant Data from BindingDB
Found 1 hit for monomerid = 50447856
Trg + Lig
Ki
nM
ΔG°
kcal/mole
IC50
nM
Kd
nM
EC50/IC50
nM
koff
s-1
kon
M-1s-1
pHTemp
°C
alpha-Glucosidase (α-Glucosidase)
(Rattus norvegicus (Rat))
BDBM50447856
(CHEMBL3114755)
Show SMILES O[C@H]1Cc2c(O)c([C@H]3[C@H](O)[C@H](Oc4cc(O)ccc34)c3ccc(O)c(O)c3)c(O)cc2O[C@@H]1c1ccc(O)c(O)c1 |r|
Show InChI InChI=1S/C30H26O11/c31-14-3-4-15-23(9-14)41-30(13-2-6-18(33)20(35)8-13)28(39)25(15)26-21(36)11-24-16(27(26)38)10-22(37)29(40-24)12-1-5-17(32)19(34)7-12/h1-9,11,22,25,28-39H,10H2/t22-,25-,28-,29+,30+/m0/s1
n/an/a 5.20E+5n/an/an/an/an/an/a
Chungnam National University
Curated by ChEMBL
Assay Description
Inhibition of rat intestinal sucrase using p-nitrophenyl-alpha-d-glucopyranoside as substrate incubated for 10 mins prior to substrate addition measu...
Bioorg Med Chem Lett 24: 1192-6 (2014)
Article DOI: 10.1016/j.bmcl.2013.12.098
BindingDB Entry DOI: 10.7270/Q2TM7CMJ