BDBM50448811 CHEMBL3128229
SMILES: Brc1ccc(cc1)C(=O)Nc1cccc(CNc2ncnc3n(CCc4ccccc4)ncc23)c1
InChI Key: InChIKey=KEFIPKHDSKXZAY-UHFFFAOYSA-N
Data: 1 IC50
Activity Spreadsheet -- Enzyme Inhibition Constant Data from BindingDB
Found 1 hit for monomerid = 50448811
Trg + Lig
Ki
nM
ΔG°
kcal/mole
IC50
nM
Kd
nM
EC50/IC50
nM
koff
s-1
kon
M-1s-1
pHTemp
°C
Proto-oncogene tyrosine-protein kinase receptor Ret
(Homo sapiens (Human))
BDBM50448811
(CHEMBL3128229)
Show SMILES Brc1ccc(cc1)C(=O)Nc1cccc(CNc2ncnc3n(CCc4ccccc4)ncc23)c1
Show InChI InChI=1S/C27H23BrN6O/c28-22-11-9-21(10-12-22)27(35)33-23-8-4-7-20(15-23)16-29-25-24-17-32-34(26(24)31-18-30-25)14-13-19-5-2-1-3-6-19/h1-12,15,17-18H,13-14,16H2,(H,33,35)(H,29,30,31)
n/an/a 4.26E+3n/an/an/an/an/an/a
Universit£ di Pisa
Curated by ChEMBL
Assay Description
Inhibition of recombinant human RET incubated for 5 mins with substrate prior to protein addition by fluorescence assay
J Med Chem 57: 1225-35 (2014)
Article DOI: 10.1021/jm401358b
BindingDB Entry DOI: 10.7270/Q2X34ZZP