BDBM50448875 CHEMBL3125266
SMILES: CCc1cc(C(=O)N[C@@H]2C[C@H](N(C2)C(=O)c2coc3ccccc23)C(=O)NCC(=O)OC)n(CC)n1
InChI Key: InChIKey=NBRXGGPTJLDUHI-APWZRJJASA-N
Data: 1 IC50
Activity Spreadsheet -- Enzyme Inhibition Constant Data from BindingDB
Found 1 hit for monomerid = 50448875
Trg + Lig
Ki
nM
ΔG°
kcal/mole
IC50
nM
Kd
nM
EC50/IC50
nM
koff
s-1
kon
M-1s-1
pHTemp
°C
Enoyl-ACP Reductase (InhA)
(Mycobacterium tuberculosis (strain ATCC 25618 / H3...)
BDBM50448875
(CHEMBL3125266)
Show SMILES CCc1cc(C(=O)N[C@@H]2C[C@H](N(C2)C(=O)c2coc3ccccc23)C(=O)NCC(=O)OC)n(CC)n1 |r|
Show InChI InChI=1S/C25H29N5O6/c1-4-15-10-20(30(5-2)28-15)24(33)27-16-11-19(23(32)26-12-22(31)35-3)29(13-16)25(34)18-14-36-21-9-7-6-8-17(18)21/h6-10,14,16,19H,4-5,11-13H2,1-3H3,(H,26,32)(H,27,33)/t16-,19+/m1/s1
n/an/a 3n/an/an/an/an/an/a
GlaxoSmithKline
Curated by ChEMBL
Assay Description
Inhibition of Mycobacterium tuberculosis full length biotinylated InhA (270 amino acids) using DDCoA as substrate assessed as NADH oxidation by fluor...
J Med Chem 57: 1276-88 (2014)
Article DOI: 10.1021/jm401326j
BindingDB Entry DOI: 10.7270/Q2NP25XB